LinuxQuestions.org
LinuxAnswers - the LQ Linux tutorial section.
Go Back   LinuxQuestions.org > Forums > Linux Forums > Linux - Distributions > Red Hat
User Name
Password
Red Hat This forum is for the discussion of Red Hat Linux.

Notices

Reply
 
Search this Thread
Old 05-03-2006, 04:23 PM   #1
gaurav_verma22
LQ Newbie
 
Registered: May 2006
Posts: 2

Rep: Reputation: 0
Error while "make modules" while recompiling the kernel on linux 2.4.21-40ELsmp


Im getting this error while running "make modules" on RH linux 2.4.21-40 (essentially, Im trying to recompile the kernel.) I was able to get # make bzImage working before this command...

$ make modules
.......
..........
.........
attribute directive ignored
In file included from qla2100.c:43:
qla2x00.c:18368: duplicate initializer
qla2x00.c:18368: (near initialization for `driver_template.use_clustering')
make[3]: *** [qla2100.o] Error 1
make[3]: Leaving directory `/usr/src/linux-2.4.21-40.EL/drivers/addon/qla2200'
make[2]: *** [_modsubdir_qla2200] Error 2
make[2]: Leaving directory `/usr/src/linux-2.4.21-40.EL/drivers/addon'
make[1]: *** [_modsubdir_addon] Error 2
make[1]: Leaving directory `/usr/src/linux-2.4.21-40.EL/drivers'
make: *** [_mod_drivers] Error 2
#

Any ideas are appreciated.. Please respond back if you can...

-- thanks

Gaurav
 
Old 05-03-2006, 04:39 PM   #2
gaurav_verma22
LQ Newbie
 
Registered: May 2006
Posts: 2

Original Poster
Rep: Reputation: 0
Also, this is what I had done before:

make mrproper
make oldconfig
make menuconfig
make dep
make
make clean
 
Old 07-19-2006, 06:32 AM   #3
Darck choclate
LQ Newbie
 
Registered: Jul 2006
Posts: 1

Rep: Reputation: 0
I am having the same problem.
If You find how to fix this, please post the details here.
 
  


Reply


Thread Tools Search this Thread
Search this Thread:

Advanced Search

Posting Rules
You may not post new threads
You may not post replies
You may not post attachments
You may not edit your posts

BB code is On
Smilies are On
[IMG] code is Off
HTML code is Off


Similar Threads
Thread Thread Starter Forum Replies Last Post
kernel compilation:throwing error related with sound during "make bzImage" b0nd Linux - Newbie 1 08-19-2005 09:16 AM
Kernel make bzImage error "undefined reference" w/ Prism2.5 USB driver under 2.6 joachimvb Mandriva 1 09-24-2004 07:43 PM
modinst error when "make modules_install", kernel 2.4.22 kc00l Slackware 7 01-23-2004 02:28 PM
Kernel compilation "make dep" error lord_clarence Red Hat 3 10-17-2003 09:41 AM
LFS 4.1: Stalled at Perl, "missing seperator" error from "make" SparceMatrix Linux From Scratch 1 06-07-2003 03:31 PM


All times are GMT -5. The time now is 11:12 AM.

Main Menu
My LQ
Write for LQ
LinuxQuestions.org is looking for people interested in writing Editorials, Articles, Reviews, and more. If you'd like to contribute content, let us know.
Main Menu
Syndicate
RSS1  Latest Threads
RSS1  LQ News
Twitter: @linuxquestions
identi.ca: @linuxquestions
Facebook: linuxquestions Google+: linuxquestions
Open Source Consulting | Domain Registration