View the Most Wanted LQ Wiki articles.
Go Back > Forums > Linux Forums > Linux - Distributions > Mandriva
User Name
Mandriva This Forum is for the discussion of Mandriva (Mandrake) Linux.


  Search this Thread
Old 08-23-2004, 06:18 PM   #1
LQ Newbie
Registered: Aug 2004
Posts: 13

Rep: Reputation: 0
internal compiler error: Segmentation fault

hi all,

I am using konstruct to build kde 3.3 and i got the folowing error :

g++ -c -pipe -fno-exceptions -Wall -W -O2 -pipe -D_REENTRANT -fPIC -DQT_SHARED -DQT_NO_DEBUG -DQT_THREAD_SUPPORT -DQT_THREAD_SUPPORT -DQT_NO_CUPS -D_LARGEFILE_SOURCE -D_LARGE_FILES -D_FILE_OFFSET_BITS=64 -DQT_NO_IMAGEIO_MNG -DQT_NO_IMAGEIO_JPEG -DQT_BUILTIN_GIF_READER=1 -DQT_NO_STYLE_MAC -DQT_NO_STYLE_AQUA -DQT_NO_STYLE_INTERLACE -DQT_NO_STYLE_WINDOWSXP -DQT_NO_STYLE_COMPACT -DQT_NO_STYLE_POCKETPC -I/home/roy/konstruct/libs/qt-x11-free/work/qt-x11-free-3.3.3/mkspecs/linux-g++ -I. -I/usr/include/freetype2 -I3rdparty/opentype -I../include -I/usr/X11R6/include -I/usr/X11R6/include -I.moc/release-shared-mt/ -o .obj/release-shared-mt/qeffects.o widgets/qeffects.cpp
../include/qguardedptr.h: In member function `void QAlphaWidget::render()':
../include/qguardedptr.h:135: internal compiler error: Segmentation fault
Please submit a full bug report,
with preprocessed source if appropriate.
See for instructions.
make[6]: *** [.obj/release-shared-mt/qeffects.o] Error 1
make[6]: Leaving directory `/home/roy/konstruct/libs/qt-x11-free/work/qt-x11-free-3.3.3/src'
make[5]: *** [sub-src] Error 2
make[5]: Leaving directory `/home/roy/konstruct/libs/qt-x11-free/work/qt-x11-free-3.3.3'
make[4]: *** [build-work/qt-x11-free-3.3.3/Makefile] Error 2
make[4]: Leaving directory `/home/roy/konstruct/libs/qt-x11-free'
make[3]: *** [dep-../../libs/qt-x11-free] Error 2
make[3]: Leaving directory `/home/roy/konstruct/libs/arts'
make[2]: *** [dep-../../libs/arts] Error 2
make[2]: Leaving directory `/home/roy/konstruct/kde/kdelibs'
make[1]: *** [dep-../../kde/kdelibs] Error 2
make[1]: Leaving directory `/home/roy/konstruct/kde/kdebase'
make: *** [dep-../../kde/kdebase] Error 2

I am using mandrake 9.2 and gcc 3.3.1

Is this an error or a bug? because there is a following sentences inside the error msg:
Please submit a full bug report,
with preprocessed source if appropriate.

thanks all...
Old 08-23-2004, 08:08 PM   #2
Registered: Apr 2004
Posts: 82

Rep: Reputation: 15
Sometimes errors like that are really problems with your ram or hardware. Try running memtest86 from your Mandrake install CD or from the memtest86 site.

Let the test run for a while and if there is no problem then report the bug. I compiled kde 3.3.0 using konstruct on my machine and it worked fine.

This happened to me a few years ago and in my case it really was bad ram.
Old 08-23-2004, 08:38 PM   #3
LQ Newbie
Registered: Aug 2004
Posts: 13

Original Poster
Rep: Reputation: 0
I will give it a try..

thanks a lot... I'll keep you all posted...


Thread Tools Search this Thread
Search this Thread:

Advanced Search

Posting Rules
You may not post new threads
You may not post replies
You may not post attachments
You may not edit your posts

BB code is On
Smilies are On
[IMG] code is Off
HTML code is Off

Similar Threads
Thread Thread Starter Forum Replies Last Post
Qt application: segmentation fault error dr_berta Programming 2 10-24-2005 03:20 PM
Segmentation Fault ERROR bluechicken Programming 8 06-30-2005 07:02 AM
segmentation fault with g++ compiler aditya1 Programming 3 03-31-2005 03:25 AM
Segmentation Fault Error ashwinipahuja Programming 1 03-29-2004 02:09 PM
[gcc] internal error: segmentation fault fskmh Slackware 3 01-22-2003 05:36 PM

All times are GMT -5. The time now is 11:40 PM.

Main Menu
Write for LQ is looking for people interested in writing Editorials, Articles, Reviews, and more. If you'd like to contribute content, let us know.
Main Menu
RSS1  Latest Threads
RSS1  LQ News
Twitter: @linuxquestions
Facebook: linuxquestions Google+: linuxquestions
Open Source Consulting | Domain Registration