LinuxQuestions.org
Did you know LQ has a Linux Hardware Compatibility List?
Go Back   LinuxQuestions.org > Forums > Linux Forums > Linux - Networking > Linux - Wireless Networking
User Name
Password
Linux - Wireless Networking This forum is for the discussion of wireless networking in Linux.

Notices

Reply
 
Search this Thread
Old 11-10-2006, 06:17 PM   #1
EnigmaX
Member
 
Registered: Jul 2003
Distribution: Fedora Core 4
Posts: 107

Rep: Reputation: 15
Problem with module compilation: RT61_Linux_STA_Drv1.0.4.0


I can't get this module to compile, and I'm not sure why, or if there is a better way to get this device to work... Heres some information and the error messages.

uname: Linux biohazard 2.6.16.21-0.25-default #1 Tue Sep 19 07:26:15 UTC 2006 x86_64 x86_64 x86_64 GNU/Linux

Device: 02:0a.0 Network controller: RaLink RT2561/RT61 802.11g PCI

Errors:
{standard input}: Assembler messages:
{standard input}:590: Error: suffix or operands invalid for `pop'
{standard input}:616: Error: suffix or operands invalid for `pop'
{standard input}:633: Error: suffix or operands invalid for `pop'
{standard input}:650: Error: suffix or operands invalid for `pop'
{standard input}:3139: Error: suffix or operands invalid for `pop'
{standard input}:3152: Error: suffix or operands invalid for `pop'
{standard input}:6245: Error: suffix or operands invalid for `pop'
{standard input}:6316: Error: suffix or operands invalid for `pop'
{standard input}:6329: Error: suffix or operands invalid for `pop'
{standard input}:8664: Error: suffix or operands invalid for `pop'
{standard input}:8694: Error: suffix or operands invalid for `pop'
{standard input}:8731: Error: suffix or operands invalid for `pop'
{standard input}:8772: Error: suffix or operands invalid for `pop'
{standard input}:8825: Error: suffix or operands invalid for `pop'
make[4]: *** [/home/ketzu/RT61_Linux_STA_Drv1.0.4.0/Module/mlme.o] Error 1
make[3]: *** [_module_/home/ketzu/RT61_Linux_STA_Drv1.0.4.0/Module] Error 2
make[2]: *** [modules] Error 2
make[1]: *** [modules] Error 2
make: *** [all] Error 2
 
  


Reply


Thread Tools Search this Thread
Search this Thread:

Advanced Search

Posting Rules
You may not post new threads
You may not post replies
You may not post attachments
You may not edit your posts

BB code is On
Smilies are On
[IMG] code is Off
HTML code is Off


Similar Threads
Thread Thread Starter Forum Replies Last Post
Kernel module with multiple source files compilation problem Last Attacker Programming 7 05-06-2006 09:10 AM
Not Finding pcibios_* functions in RHEL4 (2.6.9)..module compilation problem kumarnine Programming 1 04-13-2006 08:23 AM
Apache module compilation problem the-chains Linux - Software 1 07-22-2004 11:20 AM
Installing irda module - problem during kernel compilation hobz Linux - General 3 07-08-2004 01:34 PM
NICdriver/module compilation problem pPcG5 Linux - Networking 0 09-11-2003 05:10 AM


All times are GMT -5. The time now is 09:22 AM.

Main Menu
My LQ
Write for LQ
LinuxQuestions.org is looking for people interested in writing Editorials, Articles, Reviews, and more. If you'd like to contribute content, let us know.
Main Menu
Syndicate
RSS1  Latest Threads
RSS1  LQ News
Twitter: @linuxquestions
identi.ca: @linuxquestions
Facebook: linuxquestions Google+: linuxquestions
Open Source Consulting | Domain Registration