LinuxQuestions.org
Visit the LQ Articles and Editorials section
Go Back   LinuxQuestions.org > Forums > Linux Forums > Linux - Software
User Name
Password
Linux - Software This forum is for Software issues.
Having a problem installing a new program? Want to know which application is best for the job? Post your question in this forum.

Notices

Reply
 
Search this Thread
Old 11-01-2003, 02:52 PM   #1
TRON2
LQ Newbie
 
Registered: Oct 2003
Location: Richmond, IN
Distribution: Mandrake 9.1
Posts: 8

Rep: Reputation: 0
Question wine installation error during compile process. Please help.


I download wine from cvs, read the readme file and used the "./tools/wineinstall" wine installer. During the compile process I get an error. Anybody got a clue?
Here is the last part before I get an error....

make[3]: Entering directory `/home/tron/wine/ole'
gcc -c -I. -I. -I../include -I../include -g -O2 -Wall -mpreferred-stack-boundary=2 -fno-keep-static-consts -D__const=const -D__int8=char -D__int16=short -D__int32=int "-D__int64=long long" -fPIC -D__WINE__ -D_REENTRANT -I/usr/X11R6/include -o ole2nls.o ole2nls.c
ole2nls.c:1646:1: warning: null character(s) ignored
ole2nls.c: In function `LCMapStringW':
ole2nls.c:1646: `_t' undeclared (first use in this function)
ole2nls.c:1646: (Each undeclared identifier is reported only once
ole2nls.c:1646: for each function it appears in.)
ole2nls.c:1646: parse error before ')' token
ole2nls.c:1579: warning: unused variable `dststr_libc_len'
make[3]: *** [ole2nls.o] Error 1
make[3]: Leaving directory `/home/tron/wine/ole'
make[2]: *** [../../ole/ole.o] Error 2
make[2]: Leaving directory `/home/tron/wine/dlls/ntdll'
make[1]: *** [ntdll/libntdll.so] Error 2
make[1]: Leaving directory `/home/tron/wine/dlls'
make: *** [dlls] Error 2

Compilation failed, aborting install.

 
Old 11-02-2003, 04:11 AM   #2
Guru3
Member
 
Registered: Sep 2003
Location: //home/sweden
Distribution: RedHat 9, Fedora Core 1
Posts: 360

Rep: Reputation: 31
When did you checkout CVS from wine? Can you put it someplace so I can try with that same copy?
 
  


Reply


Thread Tools Search this Thread
Search this Thread:

Advanced Search

Posting Rules
You may not post new threads
You may not post replies
You may not post attachments
You may not edit your posts

BB code is On
Smilies are On
[IMG] code is Off
HTML code is Off


Similar Threads
Thread Thread Starter Forum Replies Last Post
Wine compile error on fd.h metalorn Linux - Software 2 09-02-2004 08:06 PM
Alsa compile error, and a WINE error scheidel21 Linux - Software 1 12-08-2003 09:16 PM
wine installation error Heeeelp me! demmylls Linux - General 1 09-23-2003 06:11 PM
Wine Error durring installation lightnb Linux - Software 0 07-16-2003 07:29 AM
Wine 20020411 installation error guiver Slackware 1 04-26-2003 04:27 PM


All times are GMT -5. The time now is 08:39 PM.

Main Menu
Advertisement
My LQ
Write for LQ
LinuxQuestions.org is looking for people interested in writing Editorials, Articles, Reviews, and more. If you'd like to contribute content, let us know.
Main Menu
Syndicate
RSS1  Latest Threads
RSS1  LQ News
Twitter: @linuxquestions
identi.ca: @linuxquestions
Facebook: linuxquestions Google+: linuxquestions
Open Source Consulting | Domain Registration