LinuxQuestions.org
Download your favorite Linux distribution at LQ ISO.
Go Back   LinuxQuestions.org > Forums > Linux Forums > Linux - Software
User Name
Password
Linux - Software This forum is for Software issues.
Having a problem installing a new program? Want to know which application is best for the job? Post your question in this forum.

Notices


Reply
  Search this Thread
Old 12-23-2002, 03:36 PM   #1
watashiwaotaku7
Member
 
Registered: Oct 2002
Location: wisconsin -- The Badger state
Distribution: gentoo
Posts: 654

Rep: Reputation: 30
wine compiling and error 2


i just downloaded winex from the cvs tree and am trying to compile it but keep getting this and i dont know what to do, what is wrong and how do i fix it?


[root@localhost wine]# ./tools/wineinstall
WINE Installer v0.71

which: no wine in (/sbin:/usr/sbin:/bin:/usr/bin:/usr/X11R6/bin:/usr/local/bin:/usr/local/sbin)
I see that WINE has already been configured, so I'll skip that.
Compiling WINE. Grab a lunch or two, rent a video, or whatever,
in the meantime...

cd `dirname debugger/__depend__` && make depend
make[1]: Entering directory `/home/justin/wine/debugger'
../tools/makedep -I. -I. -I../include -I../include -C. break.c db_disasm.c display.c expr.c ext_debugger.c gdbproxy.c hash.c info.c memory.c module.c msc.c registers.c source.c stabs.c stack.c types.c winedbg.c dbg.y debug.l -C.
make[1]: Leaving directory `/home/justin/wine/debugger'
cd `dirname dlls/__depend__` && make depend
make[1]: Entering directory `/home/justin/wine/dlls'
cd `dirname d3dgl/__depend__` && make depend
make[2]: Entering directory `/home/justin/wine/dlls/d3dgl'
../../tools/makedep -I. -I. -I../../include -I../../include -C. caps.c d3dgl_main.c fixedfunc.c light.c prim.c state.c texture.c vprogram.c -C.
make[2]: Leaving directory `/home/justin/wine/dlls/d3dgl'
cd `dirname opengl32/__depend__` && make depend
make[2]: Entering directory `/home/justin/wine/dlls/opengl32'
../../tools/makedep -I. -I. -I../../include -I../../include -C. wgl.c opengl_norm.c opengl_ext.c -C.
make[2]: Leaving directory `/home/justin/wine/dlls/opengl32'
cd `dirname x11drv/__depend__` && make depend
make[2]: Entering directory `/home/justin/wine/dlls/x11drv'
cd `dirname ../../graphics/x11drv/__depend__` && make depend
make[3]: Entering directory `/home/justin/wine/graphics/x11drv'
../../tools/makedep -I. -I. -I../../include -I../../include -C. bitblt.c bitmap.c brush.c clipping.c codepage.c dib.c graphics.c init.c objects.c opengl.c palette.c pen.c text.c xfont.c -C.
make[3]: Leaving directory `/home/justin/wine/graphics/x11drv'
cd `dirname ../../windows/x11drv/__depend__` && make depend
make[3]: Entering directory `/home/justin/wine/windows/x11drv'
../../tools/makedep -I. -I. -I../../include -I../../include -C. clipboard.c event.c keyboard.c -C.
make[3]: Leaving directory `/home/justin/wine/windows/x11drv'
../../tools/makedep -I. -I. -I../../include -I../../include -C. desktop.c dga2.c mouse.c scroll.c window.c winpos.c x11ddraw.c x11drv_main.c xrender.c xvidmode.c glx.c executebuffer.c -C.
make[2]: Leaving directory `/home/justin/wine/dlls/x11drv'
cd `dirname advapi32/__depend__` && make depend
make[2]: Entering directory `/home/justin/wine/dlls/advapi32'
../../tools/makedep -I. -I. -I../../include -I../../include -C. advapi.c crypt.c eventlog.c registry.c security.c service.c -C.
make[2]: Leaving directory `/home/justin/wine/dlls/advapi32'
cd `dirname avicap32/__depend__` && make depend
make[2]: Entering directory `/home/justin/wine/dlls/avicap32'
../../tools/makedep -I. -I. -I../../include -I../../include -C. avicap32_main.c -C.
make[2]: Leaving directory `/home/justin/wine/dlls/avicap32'
cd `dirname avifil32/__depend__` && make depend
make[2]: Entering directory `/home/justin/wine/dlls/avifil32'
../../tools/makedep -I. -I. -I../../include -I../../include -C. api.c comentry.c iafile.c iastream.c igframe.c main.c string.c -C.
./api.c: No such file or directory
make[2]: *** [depend] Error 1
make[2]: Leaving directory `/home/justin/wine/dlls/avifil32'
make[1]: *** [avifil32/__depend__] Error 2
make[1]: Leaving directory `/home/justin/wine/dlls'
make: *** [dlls/__depend__] Error 2

Compilation failed, aborting install.
[root@localhost wine]#




thanks a lot for any help
 
Old 12-24-2002, 05:32 PM   #2
Null
Member
 
Registered: Dec 2002
Distribution: Debian Woody SID
Posts: 52

Rep: Reputation: 15
You'll have better luck posting this on Transgaming's support forums.
 
Old 12-25-2002, 10:33 PM   #3
watashiwaotaku7
Member
 
Registered: Oct 2002
Location: wisconsin -- The Badger state
Distribution: gentoo
Posts: 654

Original Poster
Rep: Reputation: 30
ok thanks ill give it a try
 
  


Reply


Thread Tools Search this Thread
Search this Thread:

Advanced Search

Posting Rules
You may not post new threads
You may not post replies
You may not post attachments
You may not edit your posts

BB code is On
Smilies are On
[IMG] code is Off
HTML code is Off



Similar Threads
Thread Thread Starter Forum Replies Last Post
Trouble running wine from src wine:error while loading shared libraries: libwine.so.1 brynjarh Linux - Newbie 2 05-28-2013 11:59 AM
Error when compiling Wine BrianJ Slackware 9 08-01-2004 07:50 PM
Just finished compiling Wine, getting "couldn't find program" error Maronflower Linux - Software 1 11-10-2003 07:50 PM
Compiling Wine Catalyc Linux - Software 1 12-27-2002 10:12 PM
help compiling wine! tonyh Linux - General 3 05-28-2002 04:22 AM


All times are GMT -5. The time now is 02:51 PM.

Main Menu
Advertisement
My LQ
Write for LQ
LinuxQuestions.org is looking for people interested in writing Editorials, Articles, Reviews, and more. If you'd like to contribute content, let us know.
Main Menu
Syndicate
RSS1  Latest Threads
RSS1  LQ News
Twitter: @linuxquestions
Facebook: linuxquestions Google+: linuxquestions
Open Source Consulting | Domain Registration