Latest LQ Deal: Linux Power User Bundle
Go Back > Forums > Linux Forums > Linux - Software
User Name
Linux - Software This forum is for Software issues.
Having a problem installing a new program? Want to know which application is best for the job? Post your question in this forum.


  Search this Thread
Old 07-22-2002, 09:12 PM   #1
LQ Newbie
Registered: Jul 2002
Posts: 8

Rep: Reputation: 0
trouble compiling wine

I'm attempting to install the lastest version of wine(20020710). I managed to get through configure and make depend, but when I make I get this error.


make: *** [dlls] Error 2LD_LIBRARY_PATH="../../library:../../unicode:$LD_LIBRARY_PATH" ../../tools/wrc/wrc -I. -I. -I../../include -I../../include -o kernel.res -r kernel.rc

kernel.rc:1: Oops, segment violation
make[2]: *** [kernel.res] Aborted
make[2]: Leaving directory `/home/dack_x/wine-20020710/dlls/kernel'
make[1]: *** [kernel] Error 2
make[1]: Leaving directory `/home/dack_x/wine-20020710/dlls'
make: *** [dlls] Error 2


I tried installing using wineinstall and got this same error. What do I need to do to precede?
I have gcc3.1 and kernel-2.4.9(vanilla) on a RedHat7.2 distro.
Thank you.
Old 07-23-2002, 11:39 PM   #2
LQ Newbie
Registered: Jul 2002
Posts: 8

Original Poster
Rep: Reputation: 0

Due to numerous frustrations I reinstalled RedHat Linux 7.2 again. I think it had something to do with me installing gcc3.1 in my previous Linux installation. My RedHat7.2 comes with gcc2.96. gcc2.96 is what I used to upgrade the kernel, and gcc3.1 is what I used to compile wine in the previous installation. I used gcc9.6 on both the kernel upgrade and wine this time. Anyway wine installed without any problems this time. It's probably safe to delete this thread, admin.


Thread Tools Search this Thread
Search this Thread:

Advanced Search

Posting Rules
You may not post new threads
You may not post replies
You may not post attachments
You may not edit your posts

BB code is On
Smilies are On
[IMG] code is Off
HTML code is Off

Similar Threads
Thread Thread Starter Forum Replies Last Post
Trouble running wine from src wine:error while loading shared libraries: brynjarh Linux - Newbie 2 05-28-2013 10:59 AM
trouble compiling w/c++ eroica Linux - Software 4 03-09-2005 02:17 PM
trouble compiling fretbrner Slackware 1 01-31-2005 12:30 PM
Trouble compiling anything banZera Slackware 4 04-07-2004 10:19 AM
Trouble with compiling gamehack Debian 3 01-11-2004 08:35 AM

All times are GMT -5. The time now is 05:26 PM.

Main Menu
Write for LQ is looking for people interested in writing Editorials, Articles, Reviews, and more. If you'd like to contribute content, let us know.
Main Menu
RSS1  Latest Threads
RSS1  LQ News
Twitter: @linuxquestions
Facebook: linuxquestions Google+: linuxquestions
Open Source Consulting | Domain Registration