LinuxQuestions.org

LinuxQuestions.org (/questions/)
-   Linux - Software (http://www.linuxquestions.org/questions/linux-software-2/)
-   -   Transcode and ffmpeg not working together (http://www.linuxquestions.org/questions/linux-software-2/transcode-and-ffmpeg-not-working-together-294623/)

Aioth 02-25-2005 02:00 AM

Transcode and ffmpeg not working together
 
Gday,

I'm trying to compile transcode, but it can't seem to find ffmpeg. ffmpeg is installed.

The last bit of ./comfigure is here:
Code:

checking for sin in -lm... yes
checking ffmpeg/avcodec.h usability... no
checking ffmpeg/avcodec.h presence... no
checking for ffmpeg/avcodec.h... no
configure: error: FFmpeg (libavcodec) required, but cannot compile ffmpeg/avcodec.h

Need anymore info? Just ask, I'm not sure what's relevant.

whansard 02-25-2005 02:37 AM

you should get the cvs version of ffmpeg. there should be instructions on the transcode site.

Aioth 02-25-2005 03:47 AM

Ah, thanks. Works great now.

Aioth 02-26-2005 05:16 AM

Hmm, I've ran into another problem.

Just in case it's relevant, I'm still running Slackware 9.1

Trying to compile gdk-pixbuf-0.22.0, I get the following.

Code:

...
...
...

gmake[2]: Leaving directory `/home/thom/installs/gdk-pixbuf/gdk-pixbuf-0.21.0/demo'
Making all in doc
gmake[2]: Entering directory `/home/thom/installs/gdk-pixbuf/gdk-pixbuf-0.21.0/doc'
*** Scanning header files ***
if grep -l '^..*$' ./gdk-pixbuf.types > /dev/null ; then \
    CC="/bin/sh ../libtool --mode=compile gcc" LD="/bin/sh ../libtool --mode=link gcc" CFLAGS="-g -O2 -I.. -I.." LDFLAGS="../gdk-pixbuf/libgdk_pixbuf.la ../gdk-pixbuf/libgnomecanvaspixbuf.la -lm" gtkdoc-scanobj --module=gdk-pixbuf --output-dir=. ; \
else \
    cd . ; \
    for i in gdk-pixbuf.args gdk-pixbuf.hierarchy gdk-pixbuf.signals ; do \
              test -f $i || touch $i ; \
    done \
fi
rm -f .libs/gdk-pixbuf-scan.lo
gcc -g -O2 -I.. -I.. -c gdk-pixbuf-scan.c  -fPIC -DPIC -o .libs/gdk-pixbuf-scan.lo
gdk-pixbuf-scan.c:4:19: gnome.h: No such file or directory
In file included from gdk-pixbuf-scan.c:5:
../gdk-pixbuf/gdk-pixbuf.h:29:21: gdk/gdk.h: No such file or directory
In file included from ../gdk-pixbuf/gdk-pixbuf.h:35,
                from gdk-pixbuf-scan.c:5:
../gdk-pixbuf/gdk-pixbuf-features.h:9: syntax error before "gdk_pixbuf_major_version"
../gdk-pixbuf/gdk-pixbuf-features.h:9: warning: data definition has no type or storage class
In file included from gdk-pixbuf-scan.c:5:
../gdk-pixbuf/gdk-pixbuf.h:50: syntax error before '*' token
../gdk-pixbuf/gdk-pixbuf.h:53: syntax error before "gpointer"


...
...
...

../gdk-pixbuf/gnome-canvas-pixbuf.h:54: warning: no semicolon at end of struct or union
../gdk-pixbuf/gnome-canvas-pixbuf.h:58: syntax error before "gnome_canvas_pixbuf_get_type"
../gdk-pixbuf/gnome-canvas-pixbuf.h:58: warning: data definition has no type or storage class
gdk-pixbuf-scan.c:9: syntax error before "GtkType"
gdk-pixbuf-scan.c:9: warning: data definition has no type or storage class
gdk-pixbuf-scan.c:11: syntax error before '*' token
gdk-pixbuf-scan.c: In function `get_object_types':
gdk-pixbuf-scan.c:14: `gint' undeclared (first use in this function)
gdk-pixbuf-scan.c:14: (Each undeclared identifier is reported only once
gdk-pixbuf-scan.c:14: for each function it appears in.)
gdk-pixbuf-scan.c:14: syntax error before "i"


...
...
...

gdk-pixbuf-scan.c:678: `GTK_ARG_CHILD_ARG' undeclared (first use in this function)
gdk-pixbuf-scan.c:682: `fp' undeclared (first use in this function)
/usr/include/bits/stdio.h: At top level:
gdk-pixbuf-scan.c:349: register name not specified for `__result'
gdk-pixbuf-scan.c:349: register name not specified for `__result'
gdk-pixbuf-scan.c:573: register name not specified for `__result'
gdk-pixbuf-scan.c:573: register name not specified for `__result'
gdk-pixbuf-scan.c:574: register name not specified for `__result'
gdk-pixbuf-scan.c:574: register name not specified for `__result'
Compilation of scanner failed
gmake[2]: *** [scan-build.stamp] Error 25
gmake[2]: Leaving directory `/home/thom/installs/gdk-pixbuf/gdk-pixbuf-0.21.0/doc'
gmake[1]: *** [all-recursive] Error 1
gmake[1]: Leaving directory `/home/thom/installs/gdk-pixbuf/gdk-pixbuf-0.21.0'
gmake: *** [all-recursive-am] Error 2



All times are GMT -5. The time now is 01:15 PM.