LinuxQuestions.org
Support LQ: Use code LQ3 and save $3 on Domain Registration
Go Back   LinuxQuestions.org > Forums > Linux Forums > Linux - Software
User Name
Password
Linux - Software This forum is for Software issues.
Having a problem installing a new program? Want to know which application is best for the job? Post your question in this forum.

Notices


Reply
  Search this Thread
Old 11-12-2003, 05:29 AM   #1
LOUDSilence
Member
 
Registered: Oct 2003
Location: Sydney
Distribution: Red Hat 8
Posts: 77

Rep: Reputation: 15
Exclamation rivatv compile problems


Hi

I am trying to install rivatv for video in on my GForce4Ti4800 card. I originally had 2 warnings in the
./configure part
* had to make debs in /lib/modules/2.4.18-14/build/ directory to solve one
* had to make config in /usr/src/2.4.18-14/

./confiigure gave me this :

Checking for configured kernel headers... found [/lib/modules/2.4.18-14/build]
Checking for linux kernel >= 2.4.0... yes [2.4.18-14]
Checking for kernel build system... found
Checking for kernel configuration... found
Checking for CONFIG_MODVERSIONS... yes
Checking for CONFIG_PCI... yes [y]
Checking for CONFIG_VIDEO_DEV... yes [m]
Checking for CONFIG_PROC_FS... yes [y]
Checking for CONFIG_I2C... yes [m]
Checking for CONFIG_I2C_ALGOBIT... yes [m]
Checking for CONFIG_MODULES... yes [y]
Checking for kernel dependancies... found
Checking for RedHat... yes
Checking whether AGP code should be included... no
Checking whether software conversion code should be included... no
Creating Makefile... done
Checking your current setup for incompatibilities...
Checking for /proc... yes
Checking for kernel gcc... 3.2
Checking for framebuffer... no
Checking for SMP... no

No problems found.
To build RivaTV type `make'. For cleaning up type `make clean`.

Now when i type make i get this

make -C /lib/modules/2.4.18-14/build SUBDIRS=`pwd`/bttv modules
make[1]: Entering directory `/usr/src/linux-2.4.18-14'
make -r -f tmp_include_depends all
make[2]: Entering directory `/usr/src/linux-2.4.18-14'
make[2]: Nothing to be done for `all'.
make[2]: Leaving directory `/usr/src/linux-2.4.18-14'
make -C /home/Billy/Shared/Linux/Media/RivaTV/rivatv-0.8.3/bttv CFLAGS="-D__KERNEL__ -I/usr/src/linux-2.4.18-14/include -Wall -Wstrict-prototypes -Wno-trigraphs -O2 -fno-strict-aliasing -fno-common -fomit-frame-pointer -pipe -mpreferred-stack-boundary=2 -march=i686 -DMODULE -DMODVERSIONS -include /usr/src/linux-2.4.18-14/include/linux/modversions.h" MAKING_MODULES=1 modules
make[2]: Entering directory `/home/Billy/Shared/Linux/Media/RivaTV/rivatv-0.8.3/bttv'
gcc -D__KERNEL__ -I/usr/src/linux-2.4.18-14/include -Wall -Wstrict-prototypes -Wno-trigraphs -O2 -fno-strict-aliasing -fno-common -fomit-frame-pointer -pipe -mpreferred-stack-boundary=2 -march=i686 -DMODULE -DMODVERSIONS -include /usr/src/linux-2.4.18-14/include/linux/modversions.h -nostdinc -I /usr/lib/gcc-lib/i386-redhat-linux/3.2/include -DKBUILD_BASENAME=tuner -c -o tuner.o tuner.c
In file included from /usr/src/linux-2.4.18-14/include/linux/prefetch.h:13,
from /usr/src/linux-2.4.18-14/include/linux/list.h:6,
from /usr/src/linux-2.4.18-14/include/linux/module.h:12,
from tuner.c:1:
/usr/src/linux-2.4.18-14/include/asm/processor.h:51: warning: parameter names (without types) in function declaration
/usr/src/linux-2.4.18-14/include/asm/processor.h:51: field `loops_per_jiffy_R_ver_str' declared as a function
/usr/src/linux-2.4.18-14/include/asm/processor.h:73: invalid suffix on integer constant
/usr/src/linux-2.4.18-14/include/asm/processor.h:73: parse error before numeric
constant
/usr/src/linux-2.4.18-14/include/asm/processor.h:73: warning: function declaration isn't a prototype
/usr/src/linux-2.4.18-14/include/asm/processor.h:256: invalid suffix on integer
constant
/usr/src/linux-2.4.18-14/include/asm/processor.h:256: parse error before numeric constant
/usr/src/linux-2.4.18-14/include/asm/processor.h:256: warning: function declaration isn't a prototype
/usr/src/linux-2.4.18-14/include/asm/processor.h:260: warning: parameter names (without types) in function declaration
/usr/src/linux-2.4.18-14/include/asm/processor.h:436: invalid suffix on floating constant
/usr/src/linux-2.4.18-14/include/asm/processor.h:436: parse error before numeric constant
/usr/src/linux-2.4.18-14/include/asm/processor.h:436: `kernel_thread_R_ver_str'
declared as function returning a function
/usr/src/linux-2.4.18-14/include/asm/processor.h:436: warning: function declaration isn't a prototype
In file included from tuner.c:1:
/usr/src/linux-2.4.18-14/include/linux/module.h:183: invalid suffix on integer constant
/usr/src/linux-2.4.18-14/include/linux/module.h:183: parse error before numeric
constant
/usr/src/linux-2.4.18-14/include/linux/module.h:183: `inter_module_register_R_ver_str' declared as function returning a function
/usr/src/linux-2.4.18-14/include/linux/module.h:183: warning: function declaration isn't a prototype
/usr/src/linux-2.4.18-14/include/linux/module.h:184: invalid suffix on integer constant
/usr/src/linux-2.4.18-14/include/linux/module.h:184: parse error before numeric
constant
/usr/src/linux-2.4.18-14/include/linux/module.h:184: `inter_module_unregister_R_ver_str' declared as function returning a function
/usr/src/linux-2.4.18-14/include/linux/module.h:184: warning: function declaration isn't a prototype
/usr/src/linux-2.4.18-14/include/linux/module.h:185: `inter_module_get_R_ver_str' declared as function returning a function
/usr/src/linux-2.4.18-14/include/linux/module.h:185: warning: parameter names (without types) in function declaration
/usr/src/linux-2.4.18-14/include/linux/module.h:186: `inter_module_get_request_R_ver_str' declared as function returning a function
/usr/src/linux-2.4.18-14/include/linux/module.h:186: warning: parameter names (without types) in function declaration
/usr/src/linux-2.4.18-14/include/linux/module.h:187: invalid suffix on integer constant
/usr/src/linux-2.4.18-14/include/linux/module.h:187: parse error before numeric
constant
/usr/src/linux-2.4.18-14/include/linux/module.h:187: `inter_module_put_R_ver_str' declared as function returning a function
/usr/src/linux-2.4.18-14/include/linux/module.h:187: warning: function declaration isn't a prototype
/usr/src/linux-2.4.18-14/include/linux/module.h:196: `try_inc_mod_count_R_ver_str' declared as function returning a function
/usr/src/linux-2.4.18-14/include/linux/module.h:196: warning: parameter names (without types) in function declaration
make[2]: *** [tuner.o] Error 1
make[2]: Leaving directory `/home/Billy/Shared/Linux/Media/RivaTV/rivatv-0.8.3/bttv'
make[1]: *** [_mod_/home/Billy/Shared/Linux/Media/RivaTV/rivatv-0.8.3/bttv] Error 2
make[1]: Leaving directory `/usr/src/linux-2.4.18-14'
make: [all-kbuild] Error 2 (ignored)
make -C /lib/modules/2.4.18-14/build SUBDIRS=`pwd`/src EXTRA_CFLAGS="-I`pwd`/bttv -DRIVATV_ISREDHAT -DRIVATV_DISABLE_AGP -DRIVATV_DISABLE_CONVERSION" modules
make[1]: Entering directory `/usr/src/linux-2.4.18-14'
make -r -f tmp_include_depends all
make[2]: Entering directory `/usr/src/linux-2.4.18-14'
make[2]: Nothing to be done for `all'.
make[2]: Leaving directory `/usr/src/linux-2.4.18-14'
make -C /home/Billy/Shared/Linux/Media/RivaTV/rivatv-0.8.3/src CFLAGS="-D__KERNEL__ -I/usr/src/linux-2.4.18-14/include -Wall -Wstrict-prototypes -Wno-trigraphs -O2 -fno-strict-aliasing -fno-common -fomit-frame-pointer -pipe -mpreferred-stack-boundary=2 -march=i686 -DMODULE -DMODVERSIONS -include /usr/src/linux-2.4.18-14/include/linux/modversions.h" MAKING_MODULES=1 modules
make[2]: Entering directory `/home/Billy/Shared/Linux/Media/RivaTV/rivatv-0.8.3/src'
gcc -D__KERNEL__ -I/usr/src/linux-2.4.18-14/include -Wall -Wstrict-prototypes -Wno-trigraphs -O2 -fno-strict-aliasing -fno-common -fomit-frame-pointer -pipe -mpreferred-stack-boundary=2 -march=i686 -DMODULE -DMODVERSIONS -include /usr/src/linux-2.4.18-14/include/linux/modversions.h -I/home/Billy/Shared/Linux/Media/RivaTV/rivatv-0.8.3/bttv -DRIVATV_ISREDHAT -DRIVATV_DISABLE_AGP -DRIVATV_DISABLE_CONVERSION -nostdinc -I /usr/lib/gcc-lib/i386-redhat-linux/3.2/include -DKBUILD_BASENAME=rivatv_driver -c -o rivatv-driver.o rivatv-driver.c
In file included from /usr/src/linux-2.4.18-14/include/linux/prefetch.h:13,
from /usr/src/linux-2.4.18-14/include/linux/list.h:6,
from /usr/src/linux-2.4.18-14/include/linux/module.h:12,
from rivatv-driver.c:22:
/usr/src/linux-2.4.18-14/include/asm/processor.h:51: warning: parameter names (without types) in function declaration
/usr/src/linux-2.4.18-14/include/asm/processor.h:51: field `loops_per_jiffy_R_ver_str' declared as a function
/usr/src/linux-2.4.18-14/include/asm/processor.h:73: invalid suffix on integer constant
/usr/src/linux-2.4.18-14/include/asm/processor.h:73: parse error before numeric
constant
/usr/src/linux-2.4.18-14/include/asm/processor.h:73: warning: function declaration isn't a prototype
/usr/src/linux-2.4.18-14/include/asm/processor.h:256: invalid suffix on integer
constant
/usr/src/linux-2.4.18-14/include/asm/processor.h:256: parse error before numeric constant
/usr/src/linux-2.4.18-14/include/asm/processor.h:256: warning: function declaration isn't a prototype
/usr/src/linux-2.4.18-14/include/asm/processor.h:260: warning: parameter names (without types) in function declaration
/usr/src/linux-2.4.18-14/include/asm/processor.h:436: invalid suffix on floating constant
/usr/src/linux-2.4.18-14/include/asm/processor.h:436: parse error before numeric constant
/usr/src/linux-2.4.18-14/include/asm/processor.h:436: `kernel_thread_R_ver_str'
declared as function returning a function
/usr/src/linux-2.4.18-14/include/asm/processor.h:436: warning: function declaration isn't a prototype
In file included from rivatv-driver.c:22:
/usr/src/linux-2.4.18-14/include/linux/module.h:183: invalid suffix on integer constant
/usr/src/linux-2.4.18-14/include/linux/module.h:183: parse error before numeric
constant
/usr/src/linux-2.4.18-14/include/linux/module.h:183: `inter_module_register_R_ver_str' declared as function returning a function
/usr/src/linux-2.4.18-14/include/linux/module.h:183: warning: function declaration isn't a prototype
/usr/src/linux-2.4.18-14/include/linux/module.h:184: invalid suffix on integer constant
/usr/src/linux-2.4.18-14/include/linux/module.h:184: parse error before numeric
constant
/usr/src/linux-2.4.18-14/include/linux/module.h:184: `inter_module_unregister_R_ver_str' declared as function returning a function
/usr/src/linux-2.4.18-14/include/linux/module.h:184: warning: function declaration isn't a prototype
/usr/src/linux-2.4.18-14/include/linux/module.h:185: `inter_module_get_R_ver_str' declared as function returning a function
/usr/src/linux-2.4.18-14/include/linux/module.h:185: warning: parameter names (without types) in function declaration
/usr/src/linux-2.4.18-14/include/linux/module.h:186: `inter_module_get_request_R_ver_str' declared as function returning a function
/usr/src/linux-2.4.18-14/include/linux/module.h:186: warning: parameter names (without types) in function declaration
/usr/src/linux-2.4.18-14/include/linux/module.h:187: invalid suffix on integer constant
/usr/src/linux-2.4.18-14/include/linux/module.h:187: parse error before numeric
constant
/usr/src/linux-2.4.18-14/include/linux/module.h:187: `inter_module_put_R_ver_str' declared as function returning a function
/usr/src/linux-2.4.18-14/include/linux/module.h:187: warning: function declaration isn't a prototype
/usr/src/linux-2.4.18-14/include/linux/module.h:196: `try_inc_mod_count_R_ver_str' declared as function returning a function
/usr/src/linux-2.4.18-14/include/linux/module.h:196: warning: parameter names (without types) in function declaration
In file included from rivatv.h:9,
from rivatv-driver.c:31:
rivatv-kcompat.h:35: warning: static declaration for `vmalloc_to_page' follows non-static
make[2]: *** [rivatv-driver.o] Error 1
make[2]: Leaving directory `/home/Billy/Shared/Linux/Media/RivaTV/rivatv-0.8.3/src'
make[1]: *** [_mod_/home/Billy/Shared/Linux/Media/RivaTV/rivatv-0.8.3/src] Error 2
make[1]: Leaving directory `/usr/src/linux-2.4.18-14'
make: *** [all-kbuild] Error 2

Thanks for helping me.
 
  


Reply


Thread Tools Search this Thread
Search this Thread:

Advanced Search

Posting Rules
You may not post new threads
You may not post replies
You may not post attachments
You may not edit your posts

BB code is On
Smilies are On
[IMG] code is Off
HTML code is Off



Similar Threads
Thread Thread Starter Forum Replies Last Post
RivaTV + Tuner Card = Problems... help please! etherag Linux - Hardware 0 10-27-2004 11:21 AM
Using Rivatv with Lmsensors powadha Linux - Software 0 05-16-2004 05:33 AM
mandrake 10 and rivatv lorrdz Linux - Hardware 1 04-19-2004 10:01 PM
mandrake 10 and rivatv lorrdz Mandriva 0 03-25-2004 02:59 PM
tv grabbing with rivatv saavik Linux - Software 0 10-10-2003 06:06 AM


All times are GMT -5. The time now is 04:47 AM.

Main Menu
Advertisement
My LQ
Write for LQ
LinuxQuestions.org is looking for people interested in writing Editorials, Articles, Reviews, and more. If you'd like to contribute content, let us know.
Main Menu
Syndicate
RSS1  Latest Threads
RSS1  LQ News
Twitter: @linuxquestions
Facebook: linuxquestions Google+: linuxquestions
Open Source Consulting | Domain Registration