LinuxQuestions.org
Support LQ: Use code LQ3 and save $3 on Domain Registration
Go Back   LinuxQuestions.org > Forums > Linux Forums > Linux - Software
User Name
Password
Linux - Software This forum is for Software issues.
Having a problem installing a new program? Want to know which application is best for the job? Post your question in this forum.

Notices

Reply
 
Search this Thread
Old 08-19-2006, 11:19 AM   #1
gmick
LQ Newbie
 
Registered: Aug 2006
Distribution: Suse 10.1
Posts: 5

Rep: Reputation: 0
Python errors when make KDE3.5.4


Hi,
i am running Suse 10.1 with the KDE3.5.1 Desktop.
Through the Konstruct app I wanted to install KDE3.5.4.
Everything goes pretty well till I get to the point where it is installing Superkaramba..

Here is the EM I get:
Quote:
make[5]: Entering directory `/tmp/konstruct-stable/konstruct/kde/kdeutils/work/kdeutils-3.5.4/superkaramba/src'
/bin/sh ../../libtool --silent --tag=CXX --mode=link g++ -Wno-long-long -Wundef -ansi -D_XOPEN_SOURCE=500 -D_BSD_SOURCE -Wcastnversion -Wchar-subscripts -Wall -W -Wpointer-arith -O2 -I/root/kde3.5.4/include -I/usr/X11R6/include -L/root/kde3.5.4/lib -L/ub -O2 -pipe -I/root/kde3.5.4/include -I/usr/X11R6/include -L/root/kde3.5.4/lib -L/usr/X11R6/lib -O2 -pipe -Wformat-security -Wmat-attribute -Wno-non-virtual-dtor -fno-exceptions -fno-check-new -fno-common -DQT_CLEAN_NAMESPACE -DQT_NO_ASCII_CAST -DQT_NO_SCOMPAT -DQT_NO_TRANSLATION -L/root/kde3.5.4/lib -L/usr/X11R6/lib -L/root/kde3.5.4/lib -L/usr/X11R6/lib -o superkaramba -Wl,-eic -R /root/kde3.5.4/lib -R /root/kde3.5.4/lib -R /root/kde3.5.4/lib -R /usr/X11R6/lib -L/root/kde3.5.4/lib -L/usr/X11R6/lib b main.o karamba.o meter.o bar.o sensor.o datesensor.o textlabel.o memsensor.o uptimesensor.o cpusensor.o networksensor.o imagaph.o xmmssensor.o programsensor.o disksensor.o sensorparams.o sensorsensor.o textfilesensor.o clickarea.o noatunsensor.o karamp.o clickmap.o rsssensor.o textfield.o taskmanager.o showdesktop.o richtextlabel.o karambasessionmanaged.o systemtray.o bar_pyt_python.o textlabel_python.o richtextlabel_python.o imagelabel_python.o config_python.o misc_python.o systray_python.o task_pytt_python.o menu_python.o karambalistboxitem.o graph_python.o karambainterface.o karambaapp.o karamba_python.o lineparser.o themmesdlg.o themewidget.o kwidgetlistbox.o sknewstuff.o themelocale.o input.o sklineedit.o input_python.o svcgrp_python.o dcopinto dcopinterface_stub.o themes_layout.o themewidget_layout.o superkarambasettings.o -lkio -lkdeui -lpython2.4 -ldl -lkn
lm
meter_python.o: In function `QString2PyString(QString)':
meter_python.cpp.text+0xaa): undefined reference to `PyUnicodeUCS2_FromUnicode'
meter_python.o: In function `PyString2QString(_object*)':
meter_python.cpp.text+0x237): undefined reference to `PyUnicodeUCS2_AsUnicode'
collect2: ld returned 1 exit status
make[5]: *** [superkaramba] Error 1
make[5]: Leaving directory `/tmp/konstruct-stable/konstruct/kde/kdeutils/work/kdeutils-3.
make[4]: *** [all-recursive] Error 1
make[4]: Leaving directory `/tmp/konstruct-stable/konstruct/kde/kdeutils/work/kdeutils-3.
make[3]: *** [all-recursive] Error 1
make[3]: Leaving directory `/tmp/konstruct-stable/konstruct/kde/kdeutils/work/kdeutils-3.
make[2]: *** [all] Error 2
make[2]: Leaving directory `/tmp/konstruct-stable/konstruct/kde/kdeutils/work/kdeutils-3.
make[1]: *** [build-work/kdeutils-3.5.4/Makefile] Error 2
make[1]: Leaving directory `/tmp/konstruct-stable/konstruct/kde/kdeutils'
make: *** [dep-../../kde/kdeutils] Error 2
linux-0wdn:/tmp/konstruct-stable/konstruct/meta/kde #
Something seems to be wrong with Python (2.4) what do I do.

When searching around the net I found the following page which looks like something I can use to solve my problem (save the file somewhere in my dir structure.. .however, #1. I don't know where, and #2, don't have a clue if it will solve the issue.

This is the link (c/p in browser): svn.python.org/projects/python/branches/release24-maint/Include/unicodeobject.h


Anyhelp is appreciated...
 
  


Reply


Thread Tools Search this Thread
Search this Thread:

Advanced Search

Posting Rules
You may not post new threads
You may not post replies
You may not post attachments
You may not edit your posts

BB code is On
Smilies are On
[IMG] code is Off
HTML code is Off


Similar Threads
Thread Thread Starter Forum Replies Last Post
python errors coffeedemon Linux - Newbie 2 05-07-2006 03:18 PM
KDE3.5 Upgrade kdebindings-python dependency errors EclipseAgent Suse/Novell 26 12-27-2005 09:46 AM
kde3.4 exit errors davidsrsb Slackware 2 04-24-2005 02:43 AM
make compile errors -- python problems??? p_motch Linux - Newbie 2 07-11-2004 07:37 PM
python errors xconspirisist Linux - Software 1 02-16-2004 06:00 AM


All times are GMT -5. The time now is 09:17 PM.

Main Menu
My LQ
Write for LQ
LinuxQuestions.org is looking for people interested in writing Editorials, Articles, Reviews, and more. If you'd like to contribute content, let us know.
Main Menu
Syndicate
RSS1  Latest Threads
RSS1  LQ News
Twitter: @linuxquestions
identi.ca: @linuxquestions
Facebook: linuxquestions Google+: linuxquestions
Open Source Consulting | Domain Registration