LinuxQuestions.org
Download your favorite Linux distribution at LQ ISO.
Go Back   LinuxQuestions.org > Forums > Linux Forums > Linux - Software
User Name
Password
Linux - Software This forum is for Software issues.
Having a problem installing a new program? Want to know which application is best for the job? Post your question in this forum.

Notices


Reply
  Search this Thread
Old 01-17-2004, 01:18 PM   #1
Abdul
LQ Newbie
 
Registered: Oct 2003
Distribution: Debian 3.0r1 Woody
Posts: 27

Rep: Reputation: 15
Problems with KDE installer


I am trying to install KDE 3.1.5 using the konstruct installer. It runs fine for a while, then it stops at this error:

checking if Qt compiles without flags... no
checking if STL implementation is SGI like... no
checking if STL implementation is HP like... no
configure: error: "no known STL type found - did you forget to install libstdc++-devel ?"
make[2]: *** [configure-work/arts-1.1.5/configure] Error 1
make[2]: Leaving directory `/root/konstruct/libs/arts'
make[1]: *** [dep-../../libs/arts] Error 2
make[1]: Leaving directory `/root/konstruct/kde/kdelibs'
make: *** [dep-../../kde/kdelibs] Error 2

I have libstdc++3-dev and libstdc++5-dev installed.
 
Old 01-19-2004, 08:54 PM   #2
quatsch
LQ Addict
 
Registered: Aug 2003
Location: New York, NY
Distribution: gentoo, gentooPPC
Posts: 1,661

Rep: Reputation: 48
this is just a shot in the dark but I had mysterious errors like that compiling kde3.2beta until I updated both automake and autoconf to the latest available. Maybe you should try that. You should also check the version of gcc.
 
Old 01-20-2004, 09:03 PM   #3
enyawix
Member
 
Registered: Sep 2003
Location: ky
Distribution: gentoo
Posts: 399

Rep: Reputation: 32
arts bug?

I have gentoo and have the same probulem line for line. I think we just found a bug in the new KDE.

checking if Qt compiles without flags... no
checking if STL implementation is SGI like... no
checking if STL implementation is HP like... no
configure: error: "no known STL type found - did you forget to install libstdc++-devel ?"

!!! ERROR: kde-base/arts-1.1.5 failed.
!!! Function kde_src_compile, Line 117, Exitcode 1
!!! died running ./configure, kde_src_compile:configure
 
Old 01-21-2004, 09:18 PM   #4
enyawix
Member
 
Registered: Sep 2003
Location: ky
Distribution: gentoo
Posts: 399

Rep: Reputation: 32
This is a gcc bug and not a arts bug

You can find the info you need at http://bugs.gentoo.org/show_bug.cgi?id=38634
 
  


Reply


Thread Tools Search this Thread
Search this Thread:

Advanced Search

Posting Rules
You may not post new threads
You may not post replies
You may not post attachments
You may not edit your posts

BB code is On
Smilies are On
[IMG] code is Off
HTML code is Off



Similar Threads
Thread Thread Starter Forum Replies Last Post
ask for kde installer Yaan Linux - Software 2 09-05-2005 12:56 AM
kde font installer error egyptian Linux - Software 2 10-31-2004 03:51 AM
KDE font installer error. RoaCh Of DisCor Linux - Software 1 10-25-2004 05:44 PM
kde 3.3 with suse 9.1 ftp installer pinkfloyd Linux - Software 0 09-24-2004 12:01 AM
a good installer for KDE on FC2??? KevinAlaska Fedora 3 05-31-2004 02:02 AM


All times are GMT -5. The time now is 04:45 PM.

Main Menu
Advertisement
My LQ
Write for LQ
LinuxQuestions.org is looking for people interested in writing Editorials, Articles, Reviews, and more. If you'd like to contribute content, let us know.
Main Menu
Syndicate
RSS1  Latest Threads
RSS1  LQ News
Twitter: @linuxquestions
Facebook: linuxquestions Google+: linuxquestions
Open Source Consulting | Domain Registration