LinuxQuestions.org
Share your knowledge at the LQ Wiki.
Go Back   LinuxQuestions.org > Forums > Linux Forums > Linux - Software
User Name
Password
Linux - Software This forum is for Software issues.
Having a problem installing a new program? Want to know which application is best for the job? Post your question in this forum.

Notices


Reply
  Search this Thread
Old 11-24-2003, 07:54 AM   #1
zeroversion
LQ Newbie
 
Registered: Nov 2003
Location: Bulgaria
Distribution: Gentoo & Slackware
Posts: 5

Rep: Reputation: 0
Problem while doing make on nano-1.2.1


Hi. When I try to do make for GNU nano-1.2.1 it gives me:

/usr/lib/gcc-lib/i386-slackware-linux/3.2.2/include/curses.h:716: parse error before "subwin"
/usr/lib/gcc-lib/i386-slackware-linux/3.2.2/include/curses.h:717: parse error before "syncok"
/usr/lib/gcc-lib/i386-slackware-linux/3.2.2/include/curses.h:718: parse error before "termattrs"
/usr/lib/gcc-lib/i386-slackware-linux/3.2.2/include/curses.h:719: parse error before "termname"
/usr/lib/gcc-lib/i386-slackware-linux/3.2.2/include/curses.h:720: parse error before "tigetflag"
/usr/lib/gcc-lib/i386-slackware-linux/3.2.2/include/curses.h:721: parse error before "tigetnum"
/usr/lib/gcc-lib/i386-slackware-linux/3.2.2/include/curses.h:722: parse error before "tigetstr"
/usr/lib/gcc-lib/i386-slackware-linux/3.2.2/include/curses.h:723: parse error before "timeout"
/usr/lib/gcc-lib/i386-slackware-linux/3.2.2/include/curses.h:724: parse error before "touchline"
/usr/lib/gcc-lib/i386-slackware-linux/3.2.2/include/curses.h:725: parse error before "touchwin"
/usr/lib/gcc-lib/i386-slackware-linux/3.2.2/include/curses.h:726: parse error before "tparm"
/usr/lib/gcc-lib/i386-slackware-linux/3.2.2/include/curses.h:727: parse error before "typeahead"
/usr/lib/gcc-lib/i386-slackware-linux/3.2.2/include/curses.h:728: parse error before "ungetch"
/usr/lib/gcc-lib/i386-slackware-linux/3.2.2/include/curses.h:729: parse error before "untouchwin"
/usr/lib/gcc-lib/i386-slackware-linux/3.2.2/include/curses.h:730: parse error before "use_env"
/usr/lib/gcc-lib/i386-slackware-linux/3.2.2/include/curses.h:731: parse error before "vidattr"
/usr/lib/gcc-lib/i386-slackware-linux/3.2.2/include/curses.h:732: parse error before "vidputs"
/usr/lib/gcc-lib/i386-slackware-linux/3.2.2/include/curses.h:733: parse error before "vline"
/usr/lib/gcc-lib/i386-slackware-linux/3.2.2/include/curses.h:734: parse error before "vwprintw"
/usr/lib/gcc-lib/i386-slackware-linux/3.2.2/include/curses.h:735: parse error before "vw_printw"
/usr/lib/gcc-lib/i386-slackware-linux/3.2.2/include/curses.h:736: parse error before "vwscanw"
/usr/lib/gcc-lib/i386-slackware-linux/3.2.2/include/curses.h:737: parse error before "vw_scanw"
/usr/lib/gcc-lib/i386-slackware-linux/3.2.2/include/curses.h:738: parse error before "waddch"
/usr/lib/gcc-lib/i386-slackware-linux/3.2.2/include/curses.h:739: parse error before "waddchnstr"
/usr/lib/gcc-lib/i386-slackware-linux/3.2.2/include/curses.h:740: parse error before "waddchstr"
/usr/lib/gcc-lib/i386-slackware-linux/3.2.2/include/curses.h:741: parse error before "waddnstr"
/usr/lib/gcc-lib/i386-slackware-linux/3.2.2/include/curses.h:742: parse error before "waddstr"
/usr/lib/gcc-lib/i386-slackware-linux/3.2.2/include/curses.h:743: parse error before "wattron"
/usr/lib/gcc-lib/i386-slackware-linux/3.2.2/include/curses.h:744: parse error before "wattroff"
/usr/lib/gcc-lib/i386-slackware-linux/3.2.2/include/curses.h:745: parse error before "wattrset"
/usr/lib/gcc-lib/i386-slackware-linux/3.2.2/include/curses.h:746: parse error before "wattr_get"
/usr/lib/gcc-lib/i386-slackware-linux/3.2.2/include/curses.h:747: parse error before "wattr_on"
/usr/lib/gcc-lib/i386-slackware-linux/3.2.2/include/curses.h:748: parse error before "wattr_off"
/usr/lib/gcc-lib/i386-slackware-linux/3.2.2/include/curses.h:749: parse error before "wattr_set"
/usr/lib/gcc-lib/i386-slackware-linux/3.2.2/include/curses.h:750: parse error before "wbkgd"
/usr/lib/gcc-lib/i386-slackware-linux/3.2.2/include/curses.h:751: parse error before "wbkgdset"
/usr/lib/gcc-lib/i386-slackware-linux/3.2.2/include/curses.h:752: parse error before "wborder"
/usr/lib/gcc-lib/i386-slackware-linux/3.2.2/include/curses.h:753: parse error before "wchgat"
/usr/lib/gcc-lib/i386-slackware-linux/3.2.2/include/curses.h:754: parse error before "wclear"
/usr/lib/gcc-lib/i386-slackware-linux/3.2.2/include/curses.h:755: parse error before "wclrtobot"
/usr/lib/gcc-lib/i386-slackware-linux/3.2.2/include/curses.h:756: parse error before "wclrtoeol"
/usr/lib/gcc-lib/i386-slackware-linux/3.2.2/include/curses.h:757: parse error before "wcolor_set"
/usr/lib/gcc-lib/i386-slackware-linux/3.2.2/include/curses.h:758: parse error before "wcursyncup"
/usr/lib/gcc-lib/i386-slackware-linux/3.2.2/include/curses.h:759: parse error before "wdelch"
/usr/lib/gcc-lib/i386-slackware-linux/3.2.2/include/curses.h:760: parse error before "wdeleteln"
/usr/lib/gcc-lib/i386-slackware-linux/3.2.2/include/curses.h:761: parse error before "wechochar"
/usr/lib/gcc-lib/i386-slackware-linux/3.2.2/include/curses.h:762: parse error before "werase"
/usr/lib/gcc-lib/i386-slackware-linux/3.2.2/include/curses.h:763: parse error before "wgetch"
/usr/lib/gcc-lib/i386-slackware-linux/3.2.2/include/curses.h:764: parse error before "wgetnstr"
/usr/lib/gcc-lib/i386-slackware-linux/3.2.2/include/curses.h:765: parse error before "wgetstr"
/usr/lib/gcc-lib/i386-slackware-linux/3.2.2/include/curses.h:766: parse error before "whline"
/usr/lib/gcc-lib/i386-slackware-linux/3.2.2/include/curses.h:767: parse error before "winch"
/usr/lib/gcc-lib/i386-slackware-linux/3.2.2/include/curses.h:768: parse error before "winchnstr"
/usr/lib/gcc-lib/i386-slackware-linux/3.2.2/include/curses.h:769: parse error before "winchstr"
/usr/lib/gcc-lib/i386-slackware-linux/3.2.2/include/curses.h:770: parse error before "winnstr"
/usr/lib/gcc-lib/i386-slackware-linux/3.2.2/include/curses.h:771: parse error before "winsch"
/usr/lib/gcc-lib/i386-slackware-linux/3.2.2/include/curses.h:772: parse error before "winsdelln"
/usr/lib/gcc-lib/i386-slackware-linux/3.2.2/include/curses.h:773: parse error before "winsertln"
/usr/lib/gcc-lib/i386-slackware-linux/3.2.2/include/curses.h:774: parse error before "winsnstr"
/usr/lib/gcc-lib/i386-slackware-linux/3.2.2/include/curses.h:775: parse error before "winsstr"
/usr/lib/gcc-lib/i386-slackware-linux/3.2.2/include/curses.h:776: parse error before "winstr"
/usr/lib/gcc-lib/i386-slackware-linux/3.2.2/include/curses.h:777: parse error before "wmove"
/usr/lib/gcc-lib/i386-slackware-linux/3.2.2/include/curses.h:778: parse error before "wnoutrefresh"
/usr/lib/gcc-lib/i386-slackware-linux/3.2.2/include/curses.h:779: parse error before "wprintw"
/usr/lib/gcc-lib/i386-slackware-linux/3.2.2/include/curses.h:781: parse error before "wredrawln"
/usr/lib/gcc-lib/i386-slackware-linux/3.2.2/include/curses.h:782: parse error before "wrefresh"
/usr/lib/gcc-lib/i386-slackware-linux/3.2.2/include/curses.h:783: parse error before "wscanw"
/usr/lib/gcc-lib/i386-slackware-linux/3.2.2/include/curses.h:785: parse error before "wscrl"
/usr/lib/gcc-lib/i386-slackware-linux/3.2.2/include/curses.h:786: parse error before "wsetscrreg"
/usr/lib/gcc-lib/i386-slackware-linux/3.2.2/include/curses.h:787: parse error before "wstandout"
/usr/lib/gcc-lib/i386-slackware-linux/3.2.2/include/curses.h:788: parse error before "wstandend"
/usr/lib/gcc-lib/i386-slackware-linux/3.2.2/include/curses.h:789: parse error before "wsyncdown"
/usr/lib/gcc-lib/i386-slackware-linux/3.2.2/include/curses.h:790: parse error before "wsyncup"
/usr/lib/gcc-lib/i386-slackware-linux/3.2.2/include/curses.h:791: parse error before "wtimeout"
/usr/lib/gcc-lib/i386-slackware-linux/3.2.2/include/curses.h:792: parse error before "wtouchln"
/usr/lib/gcc-lib/i386-slackware-linux/3.2.2/include/curses.h:793: parse error before "wvline"
/usr/lib/gcc-lib/i386-slackware-linux/3.2.2/include/curses.h:1184: parse error before "getmouse"
/usr/lib/gcc-lib/i386-slackware-linux/3.2.2/include/curses.h:1185: parse error before "ungetmouse"
/usr/lib/gcc-lib/i386-slackware-linux/3.2.2/include/curses.h:1186: parse error before "mousemask"
/usr/lib/gcc-lib/i386-slackware-linux/3.2.2/include/curses.h:1187: parse error before "wenclose"
/usr/lib/gcc-lib/i386-slackware-linux/3.2.2/include/curses.h:1188: parse error before "mouseinterval"
/usr/lib/gcc-lib/i386-slackware-linux/3.2.2/include/curses.h:1189: parse error before "wmouse_trafo"
/usr/lib/gcc-lib/i386-slackware-linux/3.2.2/include/curses.h:1190: parse error before "mouse_trafo"
/usr/lib/gcc-lib/i386-slackware-linux/3.2.2/include/curses.h:1196: parse error before "mcprint"
/usr/lib/gcc-lib/i386-slackware-linux/3.2.2/include/curses.h:1197: parse error before "has_key"
/usr/lib/gcc-lib/i386-slackware-linux/3.2.2/include/curses.h:1201: parse error before "_tracef"
/usr/lib/gcc-lib/i386-slackware-linux/3.2.2/include/curses.h:1202: parse error before "_tracedump"
/usr/lib/gcc-lib/i386-slackware-linux/3.2.2/include/curses.h:1203: parse error before "_traceattr"
/usr/lib/gcc-lib/i386-slackware-linux/3.2.2/include/curses.h:1204: parse error before "_traceattr2"
/usr/lib/gcc-lib/i386-slackware-linux/3.2.2/include/curses.h:1205: parse error before "_nc_tracebits"
/usr/lib/gcc-lib/i386-slackware-linux/3.2.2/include/curses.h:1206: parse error before "_tracechar"
/usr/lib/gcc-lib/i386-slackware-linux/3.2.2/include/curses.h:1207: parse error before "_tracechtype"
/usr/lib/gcc-lib/i386-slackware-linux/3.2.2/include/curses.h:1208: parse error before "_tracechtype2"
/usr/lib/gcc-lib/i386-slackware-linux/3.2.2/include/curses.h:1218: parse error before "_tracemouse"
/usr/lib/gcc-lib/i386-slackware-linux/3.2.2/include/curses.h:1219: parse error before "trace"
/usr/lib/gcc-lib/i386-slackware-linux/3.2.2/include/curses.h:198: warning: array `acs_map' assumed to have one element
/usr/lib/gcc-lib/i386-slackware-linux/3.2.2/include/curses.h:392: warning: array `ttytype' assumed to have one element
make[2]: *** [color.o] Error 1
make[2]: Leaving directory `/root/src/nano-1.2.1'
make[1]: *** [all-recursive] Error 1
make[1]: Leaving directory `/root/src/nano-1.2.1'
make: *** [all] Error 2
root#
it gives me alot of these messages. i've tryed to do make on some other programs but it dosnt work too. it gives me errors.
i tryed to install gcc or some libs but it wont work. its not a hardware problem cos it worked a couple of hours ago and after i decided to remove some packages ;]] i got these.
my distro is slackware 9 with some updates from slackware-current.

Last edited by zeroversion; 11-24-2003 at 07:56 AM.
 
Old 11-25-2003, 04:58 AM   #2
zeroversion
LQ Newbie
 
Registered: Nov 2003
Location: Bulgaria
Distribution: Gentoo & Slackware
Posts: 5

Original Poster
Rep: Reputation: 0
ahh i found the answer. I just installed the "ncurses" package on my slackware cd.
 
  


Reply


Thread Tools Search this Thread
Search this Thread:

Advanced Search

Posting Rules
You may not post new threads
You may not post replies
You may not post attachments
You may not edit your posts

BB code is On
Smilies are On
[IMG] code is Off
HTML code is Off



Similar Threads
Thread Thread Starter Forum Replies Last Post
iPod Nano Music Player/Rythmbox Sync Problem mrbadboy Linux - Hardware 1 09-22-2005 10:54 AM
nano hostmark101 Linux - Newbie 8 08-12-2005 06:53 PM
nano -w /etc/hosts bobotoes Linux - Newbie 5 10-04-2004 01:49 PM
Gentoo installation problem with Nano k_brother Linux - Newbie 8 11-06-2003 09:12 PM
make dep,make clean,make bzImage problem Babba Linux - Newbie 2 01-08-2003 03:49 AM


All times are GMT -5. The time now is 08:22 PM.

Main Menu
Advertisement
My LQ
Write for LQ
LinuxQuestions.org is looking for people interested in writing Editorials, Articles, Reviews, and more. If you'd like to contribute content, let us know.
Main Menu
Syndicate
RSS1  Latest Threads
RSS1  LQ News
Twitter: @linuxquestions
Facebook: linuxquestions Google+: linuxquestions
Open Source Consulting | Domain Registration