LinuxQuestions.org
Latest LQ Deal: Complete CCNA, CCNP & Red Hat Certification Training Bundle
Go Back   LinuxQuestions.org > Forums > Linux Forums > Linux - Software
User Name
Password
Linux - Software This forum is for Software issues.
Having a problem installing a new program? Want to know which application is best for the job? Post your question in this forum.

Notices


Reply
  Search this Thread
Old 05-25-2003, 04:36 PM   #1
kko88
Member
 
Registered: May 2003
Location: Denver, Colorado
Distribution: Slackware 9.0
Posts: 43

Rep: Reputation: 15
Problem installing qt-copy


I'm trying to install qt-copy so I can install a theme for kde but I receive a very long error message/ series of error messages in the Konsole.

The first ... "paragraph" goes like this:
Quote:
Creating qmake. Please wait...
g++ -c -o project.o -g -I. -Igenerators -Igenerators/unix -Igenerators/win32 -Igenerators/mac -I/usr/local/qt/include/qmake -I/usr/local/qt/include -I/usr/local/qt/include -DQT_NO_TEXTCODEC -DQT_NO_UNICODETABLES -DQT_NO_COMPONENT -DQT_NO_STL -DQT_NO_COMPRESS -I/usr/local/qt/mkspecs/linux-g++ -DHAVE_QCONFIG_CPP project.cpp
In file included from project.cpp:38:
project.h:40:25: qstringlist.h: No such file or directory
project.h:41:21: qstring.h: No such file or directory
project.h:42:18: qmap.h: No such file or directory
Somewhere in the middle....

Quote:
project.cpp:89: error: `params' was not declared in this scope
project.cpp:89: error: parse error before `;' token
project.cpp:89: error: syntax error before `++' token
project.cpp:100: error: ISO C++ forbids declaration of `last' with no type
project.cpp:100: error: redefinition of `int last'
project.cpp:87: error: `int last' previously defined here
project.cpp:100: error: `x' was not declared in this scope
project.cpp:101: error: parse error before `}' token
project.cpp:108: error: syntax error before `(' token
project.cpp:111: error: 'QStringList' is used as a type, but is not defined as
a type.
project.cpp:112: error: `QChar' was not declared in this scope
project.cpp:112: error: 'QValueStack' is used as a type, but is not defined as
a type.
and the end...

Quote:
project.cpp:1122: error: `int debug_msg' previously defined here
project.cpp:1317: error: initializer list being treated as compound expression
project.cpp:1318: error: syntax error before `.' token
project.cpp:1319: error: syntax error before `+=' token
gmake: *** [project.o] Error 1
qmake failed to build. Aborting.
I'm am so very confused. Would this error require me to edit some header files and such? Or touch some of the C/C++ code? What a scary thought... Thanks for any help!
 
Old 05-25-2003, 06:12 PM   #2
schatoor
Senior Member
 
Registered: Jul 2002
Location: a tiny place caled hendrik ido ambacht in the netherlands
Distribution: SuSE, debian, slackware, lfs
Posts: 1,358

Rep: Reputation: 45
It looks like you don't have the qt headers installed. Do "locate qstring.h" for me will ye. If you don't see any thing like "/usr/local/qt/include/qstring.h", it'l mean you don't have the qt headers installed.
I'm not sure. You could try to install the development package of qt. Somthing like qt-devel<somthing>. The exact package depends on the distro you are using and what version of qt you are using now.
 
Old 05-25-2003, 07:45 PM   #3
kko88
Member
 
Registered: May 2003
Location: Denver, Colorado
Distribution: Slackware 9.0
Posts: 43

Original Poster
Rep: Reputation: 15
Thanks! I installed the devel for the qt package but then I found a readme for the qt-copy (lol stupid me for not seeing that) and that helped. Took more than an hour, but I got it! Hehe thanks for the help.
 
  


Reply


Thread Tools Search this Thread
Search this Thread:

Advanced Search

Posting Rules
You may not post new threads
You may not post replies
You may not post attachments
You may not edit your posts

BB code is On
Smilies are On
[IMG] code is Off
HTML code is Off



Similar Threads
Thread Thread Starter Forum Replies Last Post
I got stuck when installing local copy of wikipedia, can you help? Mangar Linux - Software 1 08-23-2005 07:50 AM
Installing Debian 3.0 from a hard drive copy? everest Debian 2 07-01-2004 07:55 PM
Installing gcc-where to get binary copy mjkramer Linux - Newbie 5 10-12-2003 11:10 PM
boot error after using Copy Commander to copy debian system onto larger new drive Interceptor Linux - Hardware 7 05-04-2003 01:40 PM
copy problem feind Linux - Networking 11 04-06-2003 04:27 PM


All times are GMT -5. The time now is 03:41 PM.

Main Menu
Advertisement
My LQ
Write for LQ
LinuxQuestions.org is looking for people interested in writing Editorials, Articles, Reviews, and more. If you'd like to contribute content, let us know.
Main Menu
Syndicate
RSS1  Latest Threads
RSS1  LQ News
Twitter: @linuxquestions
Facebook: linuxquestions Google+: linuxquestions
Open Source Consulting | Domain Registration