LinuxQuestions.org
Go Job Hunting at the LQ Job Marketplace
Go Back   LinuxQuestions.org > Forums > Linux Forums > Linux - Software
User Name
Password
Linux - Software This forum is for Software issues.
Having a problem installing a new program? Want to know which application is best for the job? Post your question in this forum.

Notices

Reply
 
Search this Thread
Old 07-24-2005, 04:28 PM   #1
k1piee
LQ Newbie
 
Registered: Jul 2005
Distribution: Debian squeeze
Posts: 11

Rep: Reputation: 0
pftpfxp-mew problems.


Hello!

I need some help with my pftpfxp_v0.11.4mew6, when I'm trying to compile it, I just get this

k1piee@k1piee:~/program/pftpfxp-mew$ ./configure
pFTP configure utility by HoE...
Platform = Linux
Using make = make
OpenSSL dir = /usr/local/ssl
Done, you can do "make static" or "make dynamic" now...
k1piee@k1piee:~/program/pftpfxp-mew$ make dynamic
cd src;make dynamic;cd ..
make[1]: Entering directory `/home/k1piee/program/pftpfxp-mew/src'
g++ -c -Wall -D_REENTRANT -I../include -O2 -I/usr/local/ssl/include -DTLS main.cc
main.cc:4:20: curses.h: Filen eller katalogen finns inte
main.cc:5:19: panel.h: Filen eller katalogen finns inte
In file included from main.cc:13:
../include/tcp.h: In member function `void CTCP::ResetMessage()':
../include/tcp.h:83: error: `FALSE' undeclared (first use this function)
../include/tcp.h:83: error: (Each undeclared identifier is reported only once
for each function it appears in.)
In file included from main.cc:14:
../include/server.h: In member function `void CServer::SetTransfering()':
../include/server.h:151: error: `TRUE' undeclared (first use this function)
In file included from main.cc:15:
../include/displayhandler.h: At global scope:
../include/displayhandler.h:47: error: syntaxfel before `*' token
../include/displayhandler.h:51: error: syntaxfel before `*' token
../include/displayhandler.h:68: error: type specifier omitted for parameter `
WINDOW'
../include/displayhandler.h:68: error: parsningsfel before `*' token
../include/displayhandler.h:69: error: type specifier omitted for parameter `
WINDOW'
../include/displayhandler.h:69: error: parsningsfel before `*' token
../include/displayhandler.h:72: error: `WINDOW' was not declared in this scope
../include/displayhandler.h:72: error: `window' was not declared in this scope
../include/displayhandler.h:72: error: invalid data member initialization
../include/displayhandler.h:72: error: (use `=' to initialize static data
members)
../include/displayhandler.h:72: error: variable or field `
UpdateFilelistNewPosition' declared void
../include/displayhandler.h:76: error: `WINDOW' was not declared in this scope
../include/displayhandler.h:76: error: parsningsfel before `,' token
../include/displayhandler.h:78: error: type specifier omitted for parameter `
WINDOW'
../include/displayhandler.h:78: error: parsningsfel before `*' token
../include/displayhandler.h:199: error: `WINDOW' was not declared in this scope
../include/displayhandler.h:199: error: parsningsfel before `)' token
../include/displayhandler.h:212: error: `WINDOW' was not declared in this scope
../include/displayhandler.h:212: error: parsningsfel before `,' token
../include/displayhandler.h:213: error: `WINDOW' was not declared in this scope
../include/displayhandler.h:213: error: parsningsfel before `,' token
../include/displayhandler.h:262: error: `WINDOW' was not declared in this scope
../include/displayhandler.h:262: error: parsningsfel before `)' token
../include/displayhandler.h:288: error: `WINDOW' was not declared in this scope
../include/displayhandler.h:288: error: `win' was not declared in this scope
../include/displayhandler.h:288: error: variable or field `mywborder' declared
void
main.cc:53: error: `WINDOW' was not declared in this scope
main.cc:53: error: `win' was not declared in this scope
main.cc:53: error: variable or field `mywborder' declared void
main.cc:53: error: redefinition of `int mywborder'
../include/displayhandler.h:288: error: `int mywborder' previously defined here
main.cc:53: error: syntaxfel before `{' token
make[1]: *** [main.o] Fel 1
make[1]: Leaving directory `/home/k1piee/program/pftpfxp-mew/src'
k1piee@k1piee:~/program/pftpfxp-mew$

and it wont compile.
I'm not so god at English, I'm from Sweden so if someone from Sweden can help me, it would be great.
I'm using Debian 3.1 whit kernel 2.6.8-2-686
i used mandrake before and then it worked fin but now it wont.
maybe there is some libs or something thats missing, I don't know.

thanks for your help.
 
  


Reply


Thread Tools Search this Thread
Search this Thread:

Advanced Search

Posting Rules
You may not post new threads
You may not post replies
You may not post attachments
You may not edit your posts

BB code is On
Smilies are On
[IMG] code is Off
HTML code is Off


Similar Threads
Thread Thread Starter Forum Replies Last Post
Problems Compiling pftpfxp-mew on FreeBSD (AMD64) SupaDupa *BSD 1 12-17-2005 05:11 PM
pftpfxp auto reconnect behade Linux - Software 4 01-12-2005 10:25 AM
Pftp Mew timerx Linux - Newbie 0 12-05-2004 11:52 AM
PFTP -Mew himsa Linux - Newbie 6 04-07-2004 06:23 AM
PFTP-Mew Sebboh Linux - Software 0 03-22-2004 10:53 AM


All times are GMT -5. The time now is 03:24 AM.

Main Menu
My LQ
Write for LQ
LinuxQuestions.org is looking for people interested in writing Editorials, Articles, Reviews, and more. If you'd like to contribute content, let us know.
Main Menu
Syndicate
RSS1  Latest Threads
RSS1  LQ News
Twitter: @linuxquestions
identi.ca: @linuxquestions
Facebook: linuxquestions Google+: linuxquestions
Open Source Consulting | Domain Registration