LinuxQuestions.org
Register a domain and help support LQ
Go Back   LinuxQuestions.org > Forums > Linux Forums > Linux - Software
User Name
Password
Linux - Software This forum is for Software issues.
Having a problem installing a new program? Want to know which application is best for the job? Post your question in this forum.

Notices

Reply
 
Search this Thread
Old 11-01-2005, 02:15 AM   #1
TokyoYank
Member
 
Registered: Oct 2005
Distribution: Fedora
Posts: 43

Rep: Reputation: 16
Nvu by gcc 4.0 .. compile errors!


Has anyone succeeded in compiling Nvu on a newer distro? I get the below error in Fedora Core 4, which uses gcc 4.0

... Alternatively, if you know the FC3 rpm works, please post. I'm a chicken.

Code:
gcc -o Linux2.6_x86_glibc_PTH_OPT.OBJ/asymmkey.o -c -O2 -fPIC -DLINUX1_2 -Di386 -D_XOPEN_SOURCE -DLINUX2_1 -ansi -Wall -pipe -DLINUX -Dlinux -D_POSIX_SOURCE -D_BSD_SOURCE -DHAVE_STRERROR -DXP_UNIX -DNSS_3_4_CODE -UDEBUG -DNDEBUG -D_REENTRANT -I/home/akite/dowloads-software/nvu-html-editor/mozilla/dist/include  -I../../../../dist/public/nss -I../../../../dist/private/nss -I../../../../dist/include -I/home/akite/dowloads-software/nvu-html-editor/mozilla/dist/include/nspr -I/home/akite/dowloads-software/nvu-html-editor/mozilla/dist/include/dbm -I../../../../dist/public/nspr  asymmkey.c
In file included from ../../../../dist/private/nss/nsspki1.h:57,
                 from nsspki.h:56,
                 from asymmkey.c:39:
../../../../dist/private/nss/oiddata.h:46: error: array type has incomplete element type
gmake[5]: *** [Linux2.6_x86_glibc_PTH_OPT.OBJ/asymmkey.o] Error 1
gmake[5]: Leaving directory `/home/akite/dowloads-software/nvu-html-editor/mozilla/security/nss/lib/pki'
gmake[4]: *** [libs] Error 2
gmake[4]: Leaving directory `/home/akite/dowloads-software/nvu-html-editor/mozilla/security/nss/lib'
gmake[3]: *** [libs] Error 2
gmake[3]: Leaving directory `/home/akite/dowloads-software/nvu-html-editor/mozilla/security/manager'
gmake[2]: *** [tier_40] Error 2
gmake[2]: Leaving directory `/home/akite/dowloads-software/nvu-html-editor/mozilla'
make[1]: *** [default] Error 2
make[1]: Leaving directory `/home/akite/dowloads-software/nvu-html-editor/mozilla'
make: *** [build] Error 2
 
  


Reply


Thread Tools Search this Thread
Search this Thread:

Advanced Search

Posting Rules
You may not post new threads
You may not post replies
You may not post attachments
You may not edit your posts

BB code is On
Smilies are On
[IMG] code is Off
HTML code is Off


Similar Threads
Thread Thread Starter Forum Replies Last Post
kernel compile errors with gcc 3.4.2 MarleyGPN Linux - Software 0 09-29-2004 07:03 PM
gcc-3.3.1 compile errors RTT Linux From Scratch 1 02-28-2004 06:53 PM
gcc compile errors ? qwijibow Linux - Newbie 2 07-21-2003 07:20 AM
gcc errors?? or are they? Rito Linux From Scratch 1 01-06-2003 04:54 PM
make and gcc compile errors sedandawk Linux - General 1 12-18-2002 02:56 AM


All times are GMT -5. The time now is 04:43 AM.

Main Menu
My LQ
Write for LQ
LinuxQuestions.org is looking for people interested in writing Editorials, Articles, Reviews, and more. If you'd like to contribute content, let us know.
Main Menu
Syndicate
RSS1  Latest Threads
RSS1  LQ News
Twitter: @linuxquestions
identi.ca: @linuxquestions
Facebook: linuxquestions Google+: linuxquestions
Open Source Consulting | Domain Registration