LinuxQuestions.org
View the Most Wanted LQ Wiki articles.
Go Back   LinuxQuestions.org > Forums > Linux Forums > Linux - Software
User Name
Password
Linux - Software This forum is for Software issues.
Having a problem installing a new program? Want to know which application is best for the job? Post your question in this forum.

Notices

Reply
 
Search this Thread
Old 06-07-2010, 07:33 AM   #16
EricTRA
Guru
 
Registered: May 2009
Location: Gibraltar, Gibraltar
Distribution: Fedora 20 with Awesome WM
Posts: 6,805
Blog Entries: 1

Rep: Reputation: 1290Reputation: 1290Reputation: 1290Reputation: 1290Reputation: 1290Reputation: 1290Reputation: 1290Reputation: 1290Reputation: 1290

Hi,

Found this one on the net. Check for correct version and distro though.

Kind regards,

Eric
 
Old 06-07-2010, 09:38 AM   #17
edwardcode
Member
 
Registered: Apr 2010
Posts: 161

Original Poster
Rep: Reputation: 16
when I try to install it I get this

Code:
 rpmlib(PayloadIsLzma) <= 4.4.2-1 is needed by lsb-build-base-3.1.1-6.73.i586
What was that anyways?
 
Old 06-07-2010, 12:37 PM   #18
EricTRA
Guru
 
Registered: May 2009
Location: Gibraltar, Gibraltar
Distribution: Fedora 20 with Awesome WM
Posts: 6,805
Blog Entries: 1

Rep: Reputation: 1290Reputation: 1290Reputation: 1290Reputation: 1290Reputation: 1290Reputation: 1290Reputation: 1290Reputation: 1290Reputation: 1290
Hi,

As far as I know it's in need of those libraries to be able to work with lzma compressed files. Have you found it yet?

Kind regards,

Eric
 
Old 06-07-2010, 01:10 PM   #19
edwardcode
Member
 
Registered: Apr 2010
Posts: 161

Original Poster
Rep: Reputation: 16
No I have not. I have even found the lzma rpm and installed it with the lzma daemon rpm and I still get the same missing dependency

Code:
warning: lsb-build-base-3.1.1-6.73.i586.rpm: Header V3 DSA signature: NOKEY, key ID 2686c370
error: Failed dependencies:
        rpmlib(PayloadIsLzma) <= 4.4.2-1 is needed by lsb-build-base-3.1.1-6.73.i586
 
Old 06-07-2010, 01:53 PM   #20
EricTRA
Guru
 
Registered: May 2009
Location: Gibraltar, Gibraltar
Distribution: Fedora 20 with Awesome WM
Posts: 6,805
Blog Entries: 1

Rep: Reputation: 1290Reputation: 1290Reputation: 1290Reputation: 1290Reputation: 1290Reputation: 1290Reputation: 1290Reputation: 1290Reputation: 1290
Hi,

Sorry but I'm left clueless, don't have any idea where you should be looking into right now. You could refer to the Debian packages and convert them with Alien as mentioned in a previous post of mine, but I cannot guarantee that will work. I hope someone else comes up with some ideas.

Kind regards,

Eric
 
Old 06-08-2010, 05:41 AM   #21
edwardcode
Member
 
Registered: Apr 2010
Posts: 161

Original Poster
Rep: Reputation: 16
Thanks anyways
 
Old 06-08-2010, 05:46 AM   #22
EricTRA
Guru
 
Registered: May 2009
Location: Gibraltar, Gibraltar
Distribution: Fedora 20 with Awesome WM
Posts: 6,805
Blog Entries: 1

Rep: Reputation: 1290Reputation: 1290Reputation: 1290Reputation: 1290Reputation: 1290Reputation: 1290Reputation: 1290Reputation: 1290Reputation: 1290
Hi,

You're welcome, sorry couldn't help solve the issue. You might try GroundWork Opensource, it's build around Nagios and comes with a very nice web interface.

Kind regards,

Eric
 
Old 06-08-2010, 11:39 AM   #23
edwardcode
Member
 
Registered: Apr 2010
Posts: 161

Original Poster
Rep: Reputation: 16
seems interesting I will look into it. Thank you once again
 
Old 06-08-2010, 11:43 AM   #24
EricTRA
Guru
 
Registered: May 2009
Location: Gibraltar, Gibraltar
Distribution: Fedora 20 with Awesome WM
Posts: 6,805
Blog Entries: 1

Rep: Reputation: 1290Reputation: 1290Reputation: 1290Reputation: 1290Reputation: 1290Reputation: 1290Reputation: 1290Reputation: 1290Reputation: 1290
Hi,

You're welcome, I hope you find a solution.

Kind regards,

Eric
 
Old 06-10-2010, 07:45 AM   #25
edwardcode
Member
 
Registered: Apr 2010
Posts: 161

Original Poster
Rep: Reputation: 16
whe I try to install nagios with this command

Code:
make all ; make install
I get these errors (what I think is the important part is at the bottom)

Code:
make[1]: Entering directory `/root/Desktop/nagios-3.2.1/base'
make[1]: Nothing to be done for `all'.
make[1]: Leaving directory `/root/Desktop/nagios-3.2.1/base'
cd ./cgi && make
make[1]: Entering directory `/root/Desktop/nagios-3.2.1/cgi'
gcc -g -O2 -DHAVE_CONFIG_H -DNSCGI  -o statusmap.cgi statusmap.c getcgi.o cgiutils.o cgiauth.o macros-cgi.o skiplist.o  objects-cgi.o xobjects-cgi.o statusdata-cgi.o xstatusdata-cgi.o comments-cgi.o downtime-cgi.o -lgd  -lpng -ljpeg -lz -lm 
statusmap.c:1: error: stray ## in program
statusmap.c:1: error: stray ## in program
statusmap.c:1: error: stray ## in program
statusmap.c:1: error: stray ## in program
statusmap.c:1: error: stray ## in program
statusmap.c:1: error: stray ## in program
statusmap.c:1: error: stray ## in program
statusmap.c:1: error: stray ## in program
statusmap.c:1: error: stray ## in program
statusmap.c:1: error: stray ## in program
statusmap.c:1: error: stray ## in program
statusmap.c:1: error: stray ## in program
statusmap.c:1: error: stray ## in program
statusmap.c:1: error: stray ## in program
statusmap.c:1: error: stray ## in program
statusmap.c:1: error: stray ## in program
statusmap.c:1: error: stray ## in program
statusmap.c:1: error: stray ## in program
statusmap.c:1: error: stray ## in program
statusmap.c:1: error: stray ## in program
statusmap.c:1: error: stray ## in program
statusmap.c:1: error: stray ## in program
statusmap.c:1: error: stray ## in program
statusmap.c:1: error: stray ## in program
statusmap.c:1: error: stray ## in program
statusmap.c:1: error: stray ## in program
statusmap.c:1: error: stray ## in program
statusmap.c:1: error: stray ## in program
statusmap.c:1: error: stray ## in program
statusmap.c:1: error: stray ## in program
statusmap.c:1: error: stray ## in program
statusmap.c:1: error: stray ## in program
statusmap.c:1: error: stray ## in program
statusmap.c:1: error: stray ## in program
statusmap.c:1: error: stray ## in program
statusmap.c:1: error: stray ## in program
statusmap.c:1: error: stray ## in program
statusmap.c:1: error: stray ## in program
statusmap.c:3:4: error: invalid preprocessing directive #STATUSMAP
statusmap.c:5:3: error: invalid preprocessing directive #Copyright
statusmap.c:6:3: error: invalid preprocessing directive #Last
statusmap.c:8:3: error: invalid preprocessing directive #Description
statusmap.c:10:3: error: invalid preprocessing directive #This
statusmap.c:11:3: error: invalid preprocessing directive #network
statusmap.c:13:3: error: invalid preprocessing directive #License
statusmap.c:15:3: error: invalid preprocessing directive #This
statusmap.c:16:3: error: invalid preprocessing directive #it
statusmap.c:17:3: error: invalid preprocessing directive #published
statusmap.c:19:3: error: invalid preprocessing directive #This
statusmap.c:20:3: error: invalid preprocessing directive #but
statusmap.c:21:3: error: invalid preprocessing directive #MERCHANTABILITY
statusmap.c:22:3: error: invalid preprocessing directive #GNU
statusmap.c:24:3: error: invalid preprocessing directive #You
statusmap.c:25:3: error: invalid preprocessing directive #along
statusmap.c:26:3: error: invalid preprocessing directive #Foundation
statusmap.c:27: error: stray ## in program
statusmap.c:27: error: stray ## in program
statusmap.c:27: error: stray ## in program
statusmap.c:27: error: stray ## in program
statusmap.c:27: error: stray ## in program
statusmap.c:27: error: stray ## in program
statusmap.c:27: error: stray ## in program
statusmap.c:27: error: stray ## in program
statusmap.c:27: error: stray ## in program
statusmap.c:27: error: stray ## in program
statusmap.c:27: error: stray ## in program
statusmap.c:27: error: stray ## in program
statusmap.c:27: error: stray ## in program
statusmap.c:27: error: stray ## in program
statusmap.c:27: error: stray ## in program
statusmap.c:27: error: stray ## in program
statusmap.c:27: error: stray ## in program
statusmap.c:27: error: stray ## in program
statusmap.c:27: error: stray ## in program
statusmap.c:27: error: stray ## in program
statusmap.c:27: error: stray ## in program
statusmap.c:27: error: stray ## in program
statusmap.c:27: error: stray ## in program
statusmap.c:27: error: stray ## in program
statusmap.c:27: error: stray ## in program
statusmap.c:27: error: stray ## in program
statusmap.c:27: error: stray ## in program
statusmap.c:27: error: stray ## in program
statusmap.c:27: error: stray ## in program
statusmap.c:27: error: stray ## in program
statusmap.c:27: error: stray ## in program
statusmap.c:27: error: stray ## in program
statusmap.c:27: error: stray ## in program
statusmap.c:27: error: stray ## in program
statusmap.c:27: error: stray ## in program
statusmap.c:27: error: stray ## in program
statusmap.c:27: error: stray ## in program
statusmap.c:27: error: stray # in program
make[1]: *** [statusmap.cgi] Error 1
make[1]: Leaving directory `/root/Desktop/nagios-3.2.1/cgi'
make: *** [all] Error 2
does this give you any more ideas any one
 
  


Reply


Thread Tools Search this Thread
Search this Thread:

Advanced Search

Posting Rules
You may not post new threads
You may not post replies
You may not post attachments
You may not edit your posts

BB code is On
Smilies are On
[IMG] code is Off
HTML code is Off


Similar Threads
Thread Thread Starter Forum Replies Last Post
Nagios: statusmap.cgi & Trends.cgi files missing wlchak Linux - Software 6 10-30-2009 06:47 AM
nagios + cgi aeby Linux - Server 6 09-21-2007 08:33 AM
Nagios cgi problem michieldg Linux - Software 0 12-12-2005 03:05 AM
Nagios & cgi-bin JJX Linux - Software 0 10-12-2005 07:24 AM
Nagios and Check.cgi kopite2012 Linux - Newbie 1 04-08-2004 04:42 AM


All times are GMT -5. The time now is 03:41 PM.

Main Menu
My LQ
Write for LQ
LinuxQuestions.org is looking for people interested in writing Editorials, Articles, Reviews, and more. If you'd like to contribute content, let us know.
Main Menu
Syndicate
RSS1  Latest Threads
RSS1  LQ News
Twitter: @linuxquestions
identi.ca: @linuxquestions
Facebook: linuxquestions Google+: linuxquestions
Open Source Consulting | Domain Registration