LinuxQuestions.org

LinuxQuestions.org (/questions/)
-   Linux - Software (http://www.linuxquestions.org/questions/linux-software-2/)
-   -   mysql workbench exploding upon build (http://www.linuxquestions.org/questions/linux-software-2/mysql-workbench-exploding-upon-build-822659/)

ninja master 07-28-2010 11:25 AM

mysql workbench exploding upon build
 
Code:

./schema_editor_fe.cpp:116: error: 'Gtk::EntryIconPosition' has not been declared
./schema_editor_fe.cpp: In constructor 'SchemaEditor::SchemaEditor(grt::Module*, bec::GRTManager*, const grt::BaseListRef&)':
./schema_editor_fe.cpp:73: error: 'class Gtk::Entry' has no member named 'set_icon_from_pixbuf'
./schema_editor_fe.cpp:73: error: 'ENTRY_ICON_SECONDARY' is not a member of 'Gtk'
./schema_editor_fe.cpp:74: error: 'class Gtk::Entry' has no member named 'set_icon_tooltip_text'
./schema_editor_fe.cpp:74: error: 'ENTRY_ICON_SECONDARY' is not a member of 'Gtk'
./schema_editor_fe.cpp:75: error: 'class Gtk::Entry' has no member named 'set_icon_activatable'
./schema_editor_fe.cpp:75: error: 'ENTRY_ICON_SECONDARY' is not a member of 'Gtk'
./schema_editor_fe.cpp:76: error: 'class Gtk::Entry' has no member named 'set_icon_sensitive'
./schema_editor_fe.cpp:76: error: 'ENTRY_ICON_SECONDARY' is not a member of 'Gtk'
./schema_editor_fe.cpp: In member function 'void SchemaEditor::set_name(const std::string&)':
./schema_editor_fe.cpp:105: error: 'class Gtk::Entry' has no member named 'set_icon_sensitive'
./schema_editor_fe.cpp:105: error: 'ENTRY_ICON_SECONDARY' is not a member of 'Gtk'
./schema_editor_fe.cpp:106: error: 'class Gtk::Entry' has no member named 'signal_icon_release'
./schema_editor_fe.cpp: In member function 'void SchemaEditor::refactor_schema(int, const GdkEventButton*, const std::string&)':
./schema_editor_fe.cpp:126: error: 'class Gtk::Entry' has no member named 'set_icon_sensitive'
./schema_editor_fe.cpp:126: error: 'ENTRY_ICON_SECONDARY' is not a member of 'Gtk'
make[3]: *** [schema_editor_fe.lo] Error 1
make[3]: Leaving directory `~/Downloads/mysql-workbench-gpl-5.2.25/plugins/db.mysql.editors/linux'
make[2]: *** [all-recursive] Error 1
make[2]: Leaving directory `~/Downloads/mysql-workbench-gpl-5.2.25/plugins'
make[1]: *** [all-recursive] Error 1
make[1]: Leaving directory `~/Downloads/mysql-workbench-gpl-5.2.25'
make: *** [all] Error 2

i suspect its a problem with the systems gtk

ninja master 07-28-2010 01:33 PM

i rebuilt some of my system packages, installed gtk+-2.20.1 and glib-2.25.8, and i still get the error
Code:

./schema_editor_fe.cpp:116: error: 'Gtk::EntryIconPosition' has not been declared
./schema_editor_fe.cpp: In constructor 'SchemaEditor::SchemaEditor(grt::Module*, bec::GRTManager*, const grt::BaseListRef&)':
./schema_editor_fe.cpp:73: error: 'class Gtk::Entry' has no member named 'set_icon_from_pixbuf'
./schema_editor_fe.cpp:73: error: 'ENTRY_ICON_SECONDARY' is not a member of 'Gtk'
./schema_editor_fe.cpp:74: error: 'class Gtk::Entry' has no member named 'set_icon_tooltip_text'
./schema_editor_fe.cpp:74: error: 'ENTRY_ICON_SECONDARY' is not a member of 'Gtk'
./schema_editor_fe.cpp:75: error: 'class Gtk::Entry' has no member named 'set_icon_activatable'
./schema_editor_fe.cpp:75: error: 'ENTRY_ICON_SECONDARY' is not a member of 'Gtk'
./schema_editor_fe.cpp:76: error: 'class Gtk::Entry' has no member named 'set_icon_sensitive'
./schema_editor_fe.cpp:76: error: 'ENTRY_ICON_SECONDARY' is not a member of 'Gtk'
./schema_editor_fe.cpp: In member function 'void SchemaEditor::set_name(const std::string&)':
./schema_editor_fe.cpp:105: error: 'class Gtk::Entry' has no member named 'set_icon_sensitive'
./schema_editor_fe.cpp:105: error: 'ENTRY_ICON_SECONDARY' is not a member of 'Gtk'
./schema_editor_fe.cpp:106: error: 'class Gtk::Entry' has no member named 'signal_icon_release'
./schema_editor_fe.cpp: In member function 'void SchemaEditor::refactor_schema(int, const GdkEventButton*, const std::string&)':
./schema_editor_fe.cpp:126: error: 'class Gtk::Entry' has no member named 'set_icon_sensitive'
./schema_editor_fe.cpp:126: error: 'ENTRY_ICON_SECONDARY' is not a member of 'Gtk'
make[3]: *** [schema_editor_fe.lo] Error 1
make[3]: Leaving directory `~/Downloads/mysql-workbench-gpl-5.2.25/plugins/db.mysql.editors/linux'
make[2]: *** [all-recursive] Error 1
make[2]: Leaving directory `~/Downloads/mysql-workbench-gpl-5.2.25/plugins'
make[1]: *** [all-recursive] Error 1
make[1]: Leaving directory `~/Downloads/mysql-workbench-gpl-5.2.25'
make: *** [all] Error 2



All times are GMT -5. The time now is 03:30 PM.