LinuxQuestions.org
Download your favorite Linux distribution at LQ ISO.
Go Back   LinuxQuestions.org > Forums > Linux Forums > Linux - Software
User Name
Password
Linux - Software This forum is for Software issues.
Having a problem installing a new program? Want to know which application is best for the job? Post your question in this forum.

Notices

Reply
 
LinkBack Search this Thread
Old 04-04-2004, 04:30 PM   #1
Louis_Carole
Member
 
Registered: Feb 2004
Location: Oxford, OH
Distribution: LFS 5.1.1, Slackware 9.1
Posts: 94

Rep: Reputation: 15
libbonobomm make errors


Dear All,

I'm trying to install gnomemm. One of the prerecs is libbonobomm-1.3.6. The configure runs fine for libbonobomm-1.3.6, but this happens at the make:

*****************************

bash-2.05b# make

Making all in tools
make[1]: Entering directory `/usr/local/tar/libbonobomm-1.3.6/tools'
Making all in extra_defs_gen
make[2]: Entering directory `/usr/local/tar/libbonobomm-1.3.6/tools/extra_defs_gen'
make[2]: Nothing to be done for `all'.
make[2]: Leaving directory `/usr/local/tar/libbonobomm-1.3.6/tools/extra_defs_gen'
Making all in m4
make[2]: Entering directory `/usr/local/tar/libbonobomm-1.3.6/tools/m4'
make[2]: Nothing to be done for `all'.
make[2]: Leaving directory `/usr/local/tar/libbonobomm-1.3.6/tools/m4'
make[2]: Entering directory `/usr/local/tar/libbonobomm-1.3.6/tools'
make[2]: Nothing to be done for `all-am'.
make[2]: Leaving directory `/usr/local/tar/libbonobomm-1.3.6/tools'
make[1]: Leaving directory `/usr/local/tar/libbonobomm-1.3.6/tools'
Making all in bonobomm
make[1]: Entering directory `/usr/local/tar/libbonobomm-1.3.6/bonobomm'
make all-recursive
make[2]: Entering directory `/usr/local/tar/libbonobomm-1.3.6/bonobomm'
Making all in generated
make[3]: Entering directory `/usr/local/tar/libbonobomm-1.3.6/bonobomm/generated'
if /bin/sh ../../libtool --mode=compile g++ -DHAVE_CONFIG_H -I. -I. -I../../bonobomm -DORBIT2=1 -I/usr/local/include/gtkmm-2.0 -I/usr/local/lib/gtkmm-2.0/include -I/usr/include/gtk-2.0 -I/usr/local/lib/sigc++-1.2/include -I/usr/local/include/sigc++-1.2 -I/usr/local/include/glib-2.0 -I/usr/local/lib/glib-2.0/include -I/usr/lib/gtk-2.0/include -I/usr/include/pango-1.0 -I/usr/X11R6/include -I/usr/include/freetype2 -I/usr/include/atk-1.0 -I/usr/local/include/libbonobo-2.0 -I/usr/local/include/orbit-2.0 -I/usr/local/include/bonobo-activation-2.0 -I/usr/local/include/orbitcpp-2.0 -g -O2 -MT Bonobo-cpp-common.lo -MD -MP -MF ".deps/Bonobo-cpp-common.Tpo" \
-c -o Bonobo-cpp-common.lo `test -f 'Bonobo-cpp-common.cc' || echo './'`Bonobo-cpp-common.cc; \
then mv -f ".deps/Bonobo-cpp-common.Tpo" ".deps/Bonobo-cpp-common.Plo"; \
else rm -f ".deps/Bonobo-cpp-common.Tpo"; exit 1; \
fi
g++ -DHAVE_CONFIG_H -I. -I. -I../../bonobomm -DORBIT2=1 -I/usr/local/include/gtkmm-2.0 -I/usr/local/lib/gtkmm-2.0/include -I/usr/include/gtk-2.0 -I/usr/local/lib/sigc++-1.2/include -I/usr/local/include/sigc++-1.2 -I/usr/local/include/glib-2.0 -I/usr/local/lib/glib-2.0/include -I/usr/lib/gtk-2.0/include -I/usr/include/pango-1.0 -I/usr/X11R6/include -I/usr/include/freetype2 -I/usr/include/atk-1.0 -I/usr/local/include/libbonobo-2.0 -I/usr/local/include/orbit-2.0 -I/usr/local/include/bonobo-activation-2.0 -I/usr/local/include/orbitcpp-2.0 -g -O2 -MT Bonobo-cpp-common.lo -MD -MP -MF .deps/Bonobo-cpp-common.Tpo -c Bonobo-cpp-common.cc -fPIC -DPIC -o .libs/Bonobo-cpp-common.o
In file included from Bonobo-cpp-stubs.h:11,
from Bonobo-cpp-common.cc:6:
Bonobo-cpp-common.h:3806: `TypeCode_mgr' undeclared in namespace `CORBA'
Bonobo-cpp-common.h:3806: template argument 2 is invalid
Bonobo-cpp-common.h:3806: ISO C++ forbids declaration of `type name' with no
type
Bonobo-cpp-common.h: In instantiation of `_orbitcpp::CompoundSeqBase<CORBA::TypeCode, int>':
Bonobo-cpp-common.h:3806: instantiated from `_orbitcpp::CompoundUnboundedSeq<CORBA::TypeCode, int>'
Bonobo-cpp-common.h:3806: instantiated from here
Bonobo-cpp-common.h:3806: `int' is not a class, struct, or union type
/usr/local/include/orbitcpp-2.0/orbitcpp/orb-cpp/orbitcpp_compound_seq.h:74: `
int' is not a class, struct, or union type
/usr/local/include/orbitcpp-2.0/orbitcpp/orb-cpp/orbitcpp_compound_seq.h:75: `
int' is not a class, struct, or union type
/usr/local/include/orbitcpp-2.0/orbitcpp/orb-cpp/orbitcpp_compound_seq.h:76: `
int' is not a class, struct, or union type
/usr/local/include/orbitcpp-2.0/orbitcpp/orb-cpp/orbitcpp_compound_seq.h:78: `
int' is not a class, struct, or union type
/usr/local/include/orbitcpp-2.0/orbitcpp/orb-cpp/orbitcpp_compound_seq.h:79: `
int' is not a class, struct, or union type
/usr/local/include/orbitcpp-2.0/orbitcpp/orb-cpp/orbitcpp_compound_seq.h:83: `
int' is not a class, struct, or union type
/usr/local/include/orbitcpp-2.0/orbitcpp/orb-cpp/orbitcpp_compound_seq.h:84: `
int' is not a class, struct, or union type
/usr/local/include/orbitcpp-2.0/orbitcpp/orb-cpp/orbitcpp_compound_seq.h:85: `
int' is not a class, struct, or union type
/usr/local/include/orbitcpp-2.0/orbitcpp/orb-cpp/orbitcpp_compound_seq.h:89: `
int' is not a class, struct, or union type
/usr/local/include/orbitcpp-2.0/orbitcpp/orb-cpp/orbitcpp_compound_seq.h:97: `
int' is not a class, struct, or union type
/usr/local/include/orbitcpp-2.0/orbitcpp/orb-cpp/orbitcpp_compound_seq.h:109: `
int' is not a class, struct, or union type
/usr/local/include/orbitcpp-2.0/orbitcpp/orb-cpp/orbitcpp_compound_seq.h:113: `
int' is not a class, struct, or union type
/usr/local/include/orbitcpp-2.0/orbitcpp/orb-cpp/orbitcpp_compound_seq.h:117: `
int' is not a class, struct, or union type
/usr/local/include/orbitcpp-2.0/orbitcpp/orb-cpp/orbitcpp_compound_seq.h:121: `
int' is not a class, struct, or union type
/usr/local/include/orbitcpp-2.0/orbitcpp/orb-cpp/orbitcpp_compound_seq.h: In instantiation of `_orbitcpp::CompoundUnboundedSeq<CORBA::TypeCode, int>':
Bonobo-cpp-common.h:3806: instantiated from here
/usr/local/include/orbitcpp-2.0/orbitcpp/orb-cpp/orbitcpp_compound_seq.h:130: `
int' is not a class, struct, or union type
/usr/local/include/orbitcpp-2.0/orbitcpp/orb-cpp/orbitcpp_compound_seq.h:131: `
int' is not a class, struct, or union type
/usr/local/include/orbitcpp-2.0/orbitcpp/orb-cpp/orbitcpp_compound_seq.h:134: no type named `value_t' in `class _orbitcpp::CompoundSeqBase<CORBA::TypeCode,
int>'
/usr/local/include/orbitcpp-2.0/orbitcpp/orb-cpp/orbitcpp_compound_seq.h:135: no type named `value_t' in `class _orbitcpp::CompoundSeqBase<CORBA::TypeCode,
int>'
/usr/local/include/orbitcpp-2.0/orbitcpp/orb-cpp/orbitcpp_compound_seq.h:138: no type named `size_t' in `class _orbitcpp::CompoundSeqBase<CORBA::TypeCode,
int>'
/usr/local/include/orbitcpp-2.0/orbitcpp/orb-cpp/orbitcpp_compound_seq.h:139: no type named `index_t' in `class _orbitcpp::CompoundSeqBase<CORBA::TypeCode,
int>'
/usr/local/include/orbitcpp-2.0/orbitcpp/orb-cpp/orbitcpp_compound_seq.h:140: no type named `buffer_t' in `class _orbitcpp::CompoundSeqBase<CORBA::TypeCode,
int>'
/usr/local/include/orbitcpp-2.0/orbitcpp/orb-cpp/orbitcpp_compound_seq.h:144: no type named `size_t' in `class _orbitcpp::CompoundSeqBase<CORBA::TypeCode,
int>'
/usr/local/include/orbitcpp-2.0/orbitcpp/orb-cpp/orbitcpp_compound_seq.h:152: no type named `buffer_t' in `class _orbitcpp::CompoundSeqBase<CORBA::TypeCode,
int>'
/usr/local/include/orbitcpp-2.0/orbitcpp/orb-cpp/orbitcpp_compound_seq.h:158: no type named `value_t' in `class _orbitcpp::CompoundSeqBase<CORBA::TypeCode,
int>'
/usr/local/include/orbitcpp-2.0/orbitcpp/orb-cpp/orbitcpp_compound_seq.h:164: no type named `size_t' in `class _orbitcpp::CompoundSeqBase<CORBA::TypeCode,
int>'
Bonobo-cpp-common.h:3807: syntax error before `;' token
Bonobo-cpp-common.cc: In member function `Bonobo::Unknown*
Bonobo::Moniker::resolve(const Bonobo::ResolveOptions&, const char*)':
Bonobo-cpp-common.cc:451: `GeneralError' undeclared in namespace `Bonobo'
Bonobo-cpp-common.cc:451: syntax error before `;' token
Bonobo-cpp-common.cc:452: `ex' undeclared (first use this function)
Bonobo-cpp-common.cc:452: (Each undeclared identifier is reported only once for
each function it appears in.)
Bonobo-cpp-common.cc: In member function `Bonobo::Unknown*
Bonobo::MonikerExtender::resolve(Bonobo::Moniker*, const
Bonobo::ResolveOptions&, const char*, const char*)':
Bonobo-cpp-common.cc:570: `GeneralError' undeclared in namespace `Bonobo'
Bonobo-cpp-common.cc:570: syntax error before `;' token
Bonobo-cpp-common.cc: In constructor
`Bonobo::Application::MessageDesc::MessageDesc()':
Bonobo-cpp-common.cc:7923: no matching function for call to `
_orbitcpp::CompoundUnboundedSeq<CORBA::TypeCode, int>::CompoundUnboundedSeq(
)'
/usr/local/include/orbitcpp-2.0/orbitcpp/orb-cpp/orbitcpp_compound_seq.h:128: candidates
are: _orbitcpp::CompoundUnboundedSeq<CORBA::TypeCode,
int>::CompoundUnboundedSeq(const
_orbitcpp::CompoundUnboundedSeq<CORBA::TypeCode, int>&)
Bonobo-cpp-common.cc: In constructor
`Bonobo::Application::MessageDesc::MessageDesc(const
Bonobo_Application_MessageDesc&)':
Bonobo-cpp-common.cc:7927: no matching function for call to `
_orbitcpp::CompoundUnboundedSeq<CORBA::TypeCode, int>::CompoundUnboundedSeq(
)'
/usr/local/include/orbitcpp-2.0/orbitcpp/orb-cpp/orbitcpp_compound_seq.h:128: candidates
are: _orbitcpp::CompoundUnboundedSeq<CORBA::TypeCode,
int>::CompoundUnboundedSeq(const
_orbitcpp::CompoundUnboundedSeq<CORBA::TypeCode, int>&)
Bonobo-cpp-common.cc: In member function `void
Bonobo::Application::MessageDesc::_orbitcpp_pack(Bonobo_Application_MessageDesc&)
const':
Bonobo-cpp-common.cc:7944: no matching function for call to `
_orbitcpp::CompoundUnboundedSeq<CORBA::TypeCode, int>::_orbitcpp_pack(
CORBA_sequence_CORBA_TypeCode&) const'
Bonobo-cpp-common.cc:7945: `return_type' undeclared (first use this function)
Bonobo-cpp-common.cc: In member function `void
Bonobo::Application::MessageDesc::_orbitcpp_unpack(const
Bonobo_Application_MessageDesc&)':
Bonobo-cpp-common.cc:7953: no matching function for call to `
_orbitcpp::CompoundUnboundedSeq<CORBA::TypeCode, int>::_orbitcpp_unpack(
const CORBA_sequence_CORBA_TypeCode&)'
make[3]: *** [Bonobo-cpp-common.lo] Error 1
make[3]: Leaving directory `/usr/local/tar/libbonobomm-1.3.6/bonobomm/generated'make[2]: *** [all-recursive] Error 1
make[2]: Leaving directory `/usr/local/tar/libbonobomm-1.3.6/bonobomm'
make[1]: *** [all] Error 2
make[1]: Leaving directory `/usr/local/tar/libbonobomm-1.3.6/bonobomm'
make: *** [all-recursive] Error 1


*****************************************

I haven't found anything netside on this topic yet. It isn't a development version, and I installed ORBitcpp earlier, successfully. Any suggestions?

- Ben
 
Old 04-04-2004, 05:20 PM   #2
larrykeenan
Member
 
Registered: Apr 2004
Location: Brisbane Australia
Distribution: UBUNTU 13.04
Posts: 59

Rep: Reputation: 19
Try gmake clean prior to build.
Have Fun,
Larry Keenan
 
Old 04-04-2004, 07:11 PM   #3
Louis_Carole
Member
 
Registered: Feb 2004
Location: Oxford, OH
Distribution: LFS 5.1.1, Slackware 9.1
Posts: 94

Original Poster
Rep: Reputation: 15
Unfortunately, that did not work.
 
Old 04-05-2004, 11:39 AM   #4
Louis_Carole
Member
 
Registered: Feb 2004
Location: Oxford, OH
Distribution: LFS 5.1.1, Slackware 9.1
Posts: 94

Original Poster
Rep: Reputation: 15
Could you suggest how I could help myself? I am despondent at this point. What documentation out there might help?
 
Old 04-05-2004, 08:07 PM   #5
larrykeenan
Member
 
Registered: Apr 2004
Location: Brisbane Australia
Distribution: UBUNTU 13.04
Posts: 59

Rep: Reputation: 19
http://gtkmm.sourceforge.net/gtkmm2/docs/
is the project Documentation. I'm not a c or c++ programer so I don't really know what to look for.
http://www.gtkmm.org/docs/gtkmm-2.4/docs/
for the development version

The following gleaned from that maanual-
libbonobomm
Dependencies: atk bash binutils bzip2 coreutils diffutils expat findutils gcc3 glib
Dependencies: glibc23 grep gtk+ gtkmm indent libbonobo libsigc++ linux24-header
Dependencies: m4 make mktemp net-tools orbit2 orbitcpp pango pkgconfig popt sed
Dependencies: sysfiles tar util-linux xfree86

Might be something simple like a missing package.

All the best
Larry Keenan
 
Old 04-06-2004, 12:23 PM   #6
Louis_Carole
Member
 
Registered: Feb 2004
Location: Oxford, OH
Distribution: LFS 5.1.1, Slackware 9.1
Posts: 94

Original Poster
Rep: Reputation: 15
Dear Larry,

I was loathe (and too lazy) to do that before. Not knowing the versions needed intimidated me too. I'm now trying this route. Thank you for taking the time on this one.
 
Old 04-06-2004, 12:35 PM   #7
Louis_Carole
Member
 
Registered: Feb 2004
Location: Oxford, OH
Distribution: LFS 5.1.1, Slackware 9.1
Posts: 94

Original Poster
Rep: Reputation: 15
In the meantime, I've discovered Kdevelop and Qt (I was using anjuta and GNOME). I'll be trying both. Here's crossing my fingers.
 
  


Reply


Thread Tools Search this Thread
Search this Thread:

Advanced Search

Posting Rules
You may not post new threads
You may not post replies
You may not post attachments
You may not edit your posts

BB code is On
Smilies are On
[IMG] code is Off
HTML code is Off
Trackbacks are Off
Pingbacks are On
Refbacks are Off


Similar Threads
Thread Thread Starter Forum Replies Last Post
Make errors lazwaz Linux - Software 1 05-21-2005 04:37 AM
Chap 5 Binutils make LDFLAGS & make install errors shotokan Linux From Scratch 5 04-10-2005 03:01 AM
errors with make xconfig dred Mandriva 1 01-15-2005 04:06 AM
'make' errors... drenal Linux - Newbie 3 04-21-2004 07:51 PM
Xine make errors natedogver31 Linux - Software 1 04-04-2004 10:05 AM


All times are GMT -5. The time now is 08:59 AM.

Main Menu
My LQ
Write for LQ
LinuxQuestions.org is looking for people interested in writing Editorials, Articles, Reviews, and more. If you'd like to contribute content, let us know.
Main Menu
Syndicate
RSS1  Latest Threads
RSS1  LQ News
Twitter: @linuxquestions
identi.ca: @linuxquestions
Facebook: linuxquestions Google+: linuxquestions
Open Source Consulting | Domain Registration