LinuxQuestions.org
View the Most Wanted LQ Wiki articles.
Go Back   LinuxQuestions.org > Forums > Linux Forums > Linux - Software
User Name
Password
Linux - Software This forum is for Software issues.
Having a problem installing a new program? Want to know which application is best for the job? Post your question in this forum.

Notices

Reply
 
Search this Thread
Old 08-12-2004, 05:35 PM   #1
haimeltjnfg
Member
 
Registered: May 2004
Distribution: debian
Posts: 235

Rep: Reputation: 30
How do i compile juk from the latest cvs?


How do i compile juk from the latest cvs?
juk is part of kdemultimedia. i've downloaded the latestet cvs and wanna compile it, but can't. help please!
 
Old 08-13-2004, 03:55 PM   #2
hw-tph
Senior Member
 
Registered: Sep 2003
Location: Sweden
Distribution: Debian
Posts: 3,032

Rep: Reputation: 57
So what's the error you're getting? Do you have a fully working development environment, and do you have the relevant devel packages (KDE, QT, and so on) installed?


Håkan
 
Old 08-13-2004, 08:13 PM   #3
haimeltjnfg
Member
 
Registered: May 2004
Distribution: debian
Posts: 235

Original Poster
Rep: Reputation: 30
g++ -DHAVE_CONFIG_H -I. -I. -I.. -I/usr/include/kde -I/usr/share/qt3/include -I/usr/X11R6/include -I/usr/include/kde/arts -I/usr/include/taglib -DQT_THREAD_SUPPORT -D_REENTRANT -Wnon-virtual-dtor -Wno-long-long -Wundef -ansi -D_XOPEN_SOURCE=500 -D_BSD_SOURCE -Wcast-align -Wconversion -Wchar-subscripts -Wall -W -Wpointer-arith -Wwrite-strings -O2 -Wformat-security -Wmissing-format-attribute -fno-exceptions -fno-check-new -fno-common -DQT_CLEAN_NAMESPACE -DQT_NO_ASCII_CAST -DQT_NO_STL -DQT_NO_COMPAT -DQT_NO_TRANSLATION -c -o juk.o `test -f 'juk.cpp' || echo './'`juk.cpp
juk.cpp: In constructor `JuK::JuK(QWidget*, const char*)':
juk.cpp:59: error: `ToolBar' undeclared (first use this function)
juk.cpp:59: error: (Each undeclared identifier is reported only once for each
function it appears in.)
juk.cpp:59: error: `Save' undeclared (first use this function)
juk.cpp:59: error: `Create' undeclared (first use this function)
juk.cpp:59: error: `setupGUI' undeclared (first use this function)
juk.cpp: In member function `void JuK::setupActions()':
juk.cpp:143: error: `setCheckedState' undeclared (first use this function)
make[1]: *** [juk.o] Error 1
make[1]: Leaving directory `/home/james/kdemultimedia/juk'
make: *** [all-recursive] Error 1
james@a4-1800:~/kdemultimedia/juk$
 
  


Reply


Thread Tools Search this Thread
Search this Thread:

Advanced Search

Posting Rules
You may not post new threads
You may not post replies
You may not post attachments
You may not edit your posts

BB code is On
Smilies are On
[IMG] code is Off
HTML code is Off


Similar Threads
Thread Thread Starter Forum Replies Last Post
Amorak, XMMS and Juk Juk not working Ipsofacto Linux - Software 6 10-02-2005 07:37 AM
Compile Problems With the Latest WINE J_7D5 Linux - Software 1 09-02-2005 05:26 PM
redhat 9, 2.6.9 kernel problem with prism54-cvs-latest septanla Linux - Wireless Networking 2 12-15-2004 07:36 PM
How do I compile the latest kernel for SuSE 9.0? MatthewASmith79 Linux - Newbie 2 08-02-2004 08:04 PM
Anyone compile latest GAIM on Woody Cage47 Linux - Software 10 02-25-2003 08:55 PM


All times are GMT -5. The time now is 04:32 AM.

Main Menu
My LQ
Write for LQ
LinuxQuestions.org is looking for people interested in writing Editorials, Articles, Reviews, and more. If you'd like to contribute content, let us know.
Main Menu
Syndicate
RSS1  Latest Threads
RSS1  LQ News
Twitter: @linuxquestions
identi.ca: @linuxquestions
Facebook: linuxquestions Google+: linuxquestions
Open Source Consulting | Domain Registration