Register a domain and help support LQ
Go Back > Forums > Linux Forums > Linux - Software
User Name
Linux - Software This forum is for Software issues.
Having a problem installing a new program? Want to know which application is best for the job? Post your question in this forum.


  Search this Thread
Old 12-23-2009, 11:27 AM   #1
LQ Newbie
Registered: Dec 2009
Posts: 1

Rep: Reputation: 0
Error compiling QT on Suse Linux 9.3 (x86-64)

Dear Linux-ers,

I have encountered a compilation error while installing the QT software on Suse Linux 9.3 (x86-64), and I have no idea what it means. The error message is as follows:

kernel/qmetaobject.cpp: In static member function `static QByteArray
  QMetaObject::normalizedType(const char*)':
kernel/qmetaobject.cpp:946: error: syntax error before `+' token
kernel/qmetaobject.cpp:947: error: request for member `data' in
  which is of non-aggregate type `QVarLengthArray<char, 256> ()(...)'
kernel/qmetaobject.cpp:949: error: request for member `data' in
  which is of non-aggregate type `QVarLengthArray<char, 256> ()(...)'
gmake[1]: *** [.obj/release-shared/qmetaobject.o] Error 1
gmake[1]: Leaving directory
gmake: *** [sub-corelib-make_default-ordered] Error 2

This error is related to the following function in qmetaobject.cpp:

QByteArray QMetaObject::normalizedType(const char *type)
    QByteArray result;

    if (!type || !*type)
        return result;

    QVarLengthArray<char> stackbuf(int(strlen(type)) + 1);
    int templdepth = 0;
    qNormalizeType(, templdepth, result);

    return result;

I will greatly appreciate any help and suggestion,

Old 03-05-2010, 12:36 PM   #2
LQ Newbie
Registered: Jan 2009
Location: Baltimore, MD
Posts: 3

Rep: Reputation: 0
Qt make error

I'm having the same issue. Did you have any luck tracking down your problem?


Thread Tools Search this Thread
Search this Thread:

Advanced Search

Posting Rules
You may not post new threads
You may not post replies
You may not post attachments
You may not edit your posts

BB code is On
Smilies are On
[IMG] code is Off
HTML code is Off

Similar Threads
Thread Thread Starter Forum Replies Last Post
Error when compiling kernel at arch/x86/boot/compressed/misc.c ronzo Linux - Kernel 0 03-29-2009 12:04 PM
Compiling x86 apps on an x86-46 system. arfon Linux - Software 2 10-06-2008 03:13 AM
Cross-compiling using x86 linux, for UltraSPARC III Cu running SunOS 5.8 Oxagast Solaris / OpenSolaris 1 03-28-2008 02:31 PM
suse linux 10 oss compiling error davedaveman Linux - Software 6 01-02-2006 03:19 PM
Compiling Linux Binaries for use with other x86 systems? karlan Linux - Software 2 03-13-2004 03:46 PM

All times are GMT -5. The time now is 06:58 AM.

Main Menu
Write for LQ is looking for people interested in writing Editorials, Articles, Reviews, and more. If you'd like to contribute content, let us know.
Main Menu
RSS1  Latest Threads
RSS1  LQ News
Twitter: @linuxquestions
Facebook: linuxquestions Google+: linuxquestions
Open Source Consulting | Domain Registration