LinuxQuestions.org
Share your knowledge at the LQ Wiki.
Go Back   LinuxQuestions.org > Forums > Linux Forums > Linux - Software
User Name
Password
Linux - Software This forum is for Software issues.
Having a problem installing a new program? Want to know which application is best for the job? Post your question in this forum.

Notices


Reply
  Search this Thread
Old 07-19-2003, 11:58 AM   #1
hulf_slo
LQ Newbie
 
Registered: Jul 2003
Location: Maribor Slovenija
Distribution: Slackware
Posts: 24

Rep: Reputation: 15
Error compiling k3b or cdbakeoven


Hi,
I can't compile k3b or cdbakeoven .....
I have gcc3.3, 2.6-test1, slackware 9, cdrtools-2.0.3...
I get this error:

in file included from /usr/include/linux/cdrom.h:14,
from k3bmmc.h:36,
from k3bdevice.h:22,
from k3bdevicewidget.h:22,
from k3bdevicewidget.cpp:17:
/usr/include/asm/byteorder.h:38: error: syntax error before `(' token
/usr/include/asm/byteorder.h:42: error: '__u64' is used as a type, but is not
defined as a type.
/usr/include/asm/byteorder.h:43: error: parse error before `}' token
/usr/include/asm/byteorder.h:44: error: syntax error before `.' token
/usr/include/asm/byteorder.h:50: error: syntax error before `.' token
/usr/include/asm/byteorder.h:51: error: syntax error before `.' token
/usr/include/asm/byteorder.h:52: error: parse error before `:' token
In file included from /usr/include/linux/byteorder/little_endian.h:11,
from /usr/include/asm/byteorder.h:65,
from /usr/include/linux/cdrom.h:14,
from k3bmmc.h:36,
from k3bdevice.h:22,
from k3bdevicewidget.h:22,
from k3bdevicewidget.cpp:17:
/usr/include/linux/byteorder/swab.h:199: error: syntax error before `(' token
/usr/include/linux/byteorder/swab.h:209: error: syntax error before `(' token
/usr/include/linux/byteorder/swab.h:213: error: `__u64' was not declared in
this scope
/usr/include/linux/byteorder/swab.h:213: error: `addr' was not declared in this
scope
/usr/include/linux/byteorder/swab.h:214: error: variable or field `__swab64s'
declared void
/usr/include/linux/byteorder/swab.h:214: error: `__swab64s' declared as an
`inline' variable
/usr/include/linux/byteorder/swab.h:214: error: syntax error before `{' token

make[4]: *** [k3bdevicewidget.lo] Error 1
make[4]: Leaving directory `/linux2003/cdburning/k3b-0.9pre2/src/core/device'
make[3]: *** [all-recursive] Error 1
make[3]: Leaving directory `/linux2003/cdburning/k3b-0.9pre2/src/core'
make[2]: *** [all-recursive] Error 1
make[2]: Leaving directory `/linux2003/cdburning/k3b-0.9pre2/src'
make[1]: *** [all-recursive] Error 1
make[1]: Leaving directory `/linux2003/cdburning/k3b-0.9pre2'
make: *** [all] Error 2

Thnx..
 
  


Reply


Thread Tools Search this Thread
Search this Thread:

Advanced Search

Posting Rules
You may not post new threads
You may not post replies
You may not post attachments
You may not edit your posts

BB code is On
Smilies are On
[IMG] code is Off
HTML code is Off



Similar Threads
Thread Thread Starter Forum Replies Last Post
Compiling K3b from source - can't find X includes timelord726 Linux - Software 3 08-13-2004 05:10 PM
Strange cdbakeoven prob! Braveheart1980 Linux - Software 4 02-05-2004 04:57 PM
Anyone sucessfully install cdbakeoven? solspin Linux - Software 0 07-05-2003 12:50 PM
cdbakeoven dependancy Johng Linux - Software 2 12-07-2002 04:25 PM
Can't burn audio in CDBakeoven, permissions prob? bax Linux - Software 22 10-03-2002 06:31 PM

LinuxQuestions.org > Forums > Linux Forums > Linux - Software

All times are GMT -5. The time now is 11:42 PM.

Main Menu
Advertisement
My LQ
Write for LQ
LinuxQuestions.org is looking for people interested in writing Editorials, Articles, Reviews, and more. If you'd like to contribute content, let us know.
Main Menu
Syndicate
RSS1  Latest Threads
RSS1  LQ News
Twitter: @linuxquestions
Facebook: linuxquestions Google+: linuxquestions
Open Source Consulting | Domain Registration