LinuxQuestions.org
Visit Jeremy's Blog.
Go Back   LinuxQuestions.org > Forums > Linux Forums > Linux - Software
User Name
Password
Linux - Software This forum is for Software issues.
Having a problem installing a new program? Want to know which application is best for the job? Post your question in this forum.

Notices



Reply
 
Search this Thread
Old 09-17-2005, 11:30 PM   #1
Agentvenom
Member
 
Registered: Sep 2005
Distribution: PCLinuxOS 2007 / Suse 10.3
Posts: 228

Rep: Reputation: 30
Enlightenment compiling issue


I'm trying to install enlightenment (e17) in SuSE 9.3. So far I've compiled eet, evas, ecore, embryo, imlib2, edje, enlightenment in that order as per recommendation of http://enlightenment.freedesktop.org/ However, when I get to the enlightenment package, I have an error in the "make" stage I can't solve. I get the error "/usr/local/bin/edje_cc: error while loading shared libraries: libedje.so.0: cannot open shared object file: No such file or directory" However, the edje package compiled with no problems. I have read where others have solved this with apt-get and repositories. What can I do to solve it in SuSE? Also, I've looked /usr/local/lib and libedje.so.0 is in there. Any ideas anyone?
 
Old 09-18-2005, 02:01 AM   #2
Agentvenom
Member
 
Registered: Sep 2005
Distribution: PCLinuxOS 2007 / Suse 10.3
Posts: 228

Original Poster
Rep: Reputation: 30
nevermind...I got it, now to solve the next compiling issue....
 
Old 09-18-2005, 05:16 AM   #3
Agentvenom
Member
 
Registered: Sep 2005
Distribution: PCLinuxOS 2007 / Suse 10.3
Posts: 228

Original Poster
Rep: Reputation: 30
Well, my next compiling issue is on the same compile! It now says:

Code:
/usr/local/bin/edje_cc: Wrote     36494 bytes (  36Kb) for "fonts/Edje Vera Bold" font entry "VeraBd.ttf" compress: [real: 37.8%]
/usr/local/bin/edje_cc: Error. unable to load image for image "brushed.png" part entry to ../../data/init/init.edj
make[4]: *** [init.edj] Error 255
make[4]: Leaving directory `/home/hardwire/enlightenment-0.16.999.013/data/init'
make[3]: *** [all-recursive] Error 1
make[3]: Leaving directory `/home/hardwire/enlightenment-0.16.999.013/data/init'
make[2]: *** [all-recursive] Error 1
make[2]: Leaving directory `/home/hardwire/enlightenment-0.16.999.013/data'
make[1]: *** [all-recursive] Error 1
make[1]: Leaving directory `/home/hardwire/enlightenment-0.16.999.013'
make: *** [all-recursive-am] Error 2
I know others have had this issue, but I can't find out how anyone fixed it.

Any suggestions???

Last edited by Agentvenom; 09-18-2005 at 05:23 AM.
 
Old 09-18-2005, 03:00 PM   #4
Agentvenom
Member
 
Registered: Sep 2005
Distribution: PCLinuxOS 2007 / Suse 10.3
Posts: 228

Original Poster
Rep: Reputation: 30
C'mon you linux Gurus!!!! I've solved probably twenty compiling issues to get to this point and enlightnment is soooo close to be installed. I'm just stuck on this last little hanger...any ideas would be of great help and much appreciated!!!!!
 
Old 09-22-2005, 12:30 PM   #5
Agentvenom
Member
 
Registered: Sep 2005
Distribution: PCLinuxOS 2007 / Suse 10.3
Posts: 228

Original Poster
Rep: Reputation: 30
Okay, I got it to compile. Now I am running enlightenment!!! If anyone else ever needs to know....to get past that last compiling error I posted, you need to install libpng and libpng-devel. Thank you to those who read this anyway!!!

Just an fyi for you linux junkies who are interested. Enlightenment window manager is pretty sweet!!!

Last edited by Agentvenom; 09-22-2005 at 12:33 PM.
 
Old 09-22-2005, 04:30 PM   #6
AxeZ
Member
 
Registered: Sep 2002
Location: Novi Sad, Vojvodina
Distribution: Slackware, FreeBSD
Posts: 386

Rep: Reputation: 32
Quote:
Originally posted by Agentvenom
[B]Okay, I got it to compile. Now I am running enlightenment!!! If anyone else ever needs to know....to get past that last compiling error I posted, you need to install libpng and libpng-devel. Thank you to those who read this anyway!!!

Now really......Shouldn't have Libpng been installed in the first place anyway?
I Don't understand the mastermind after the installation of distribution without libpng????
 
Old 09-22-2005, 07:20 PM   #7
Agentvenom
Member
 
Registered: Sep 2005
Distribution: PCLinuxOS 2007 / Suse 10.3
Posts: 228

Original Poster
Rep: Reputation: 30
Well, I'm sure it was installed. However, it would not show up in my ./configure step until I installed the libpng-devel. I dunno why, that's just what happened.
 
Old 09-23-2005, 09:40 AM   #8
AxeZ
Member
 
Registered: Sep 2002
Location: Novi Sad, Vojvodina
Distribution: Slackware, FreeBSD
Posts: 386

Rep: Reputation: 32
Well, in some ackward way, RH and distros based on RH have separated header files needed for compilations into separate packages, so called devel packages.
So, in order to compile anything against some library you need to have it's header files which are strangely enough in devel packages......

Stupid, but ok..
I guess not every distro could be like Slackware.
 
Old 09-23-2005, 03:08 PM   #9
Agentvenom
Member
 
Registered: Sep 2005
Distribution: PCLinuxOS 2007 / Suse 10.3
Posts: 228

Original Poster
Rep: Reputation: 30
Haha, well at least now I know what the deal is, so thank you. And I'm sure Slackware appreciates the plug!
 
Old 04-05-2011, 11:15 AM   #10
venki86
LQ Newbie
 
Registered: Mar 2011
Location: Chennai,India
Distribution: Debian
Posts: 4

Rep: Reputation: 0
Enlightment Elementary package Installation error

I need help in solving this . I'm trying to install enlightment elementary package and i'm done with first step ie . configure , when i try to give make i get the following error . I remember someone has solved this earlier .

/usr/local/bin/edje_cc: error while loading shared libraries: libedje.so.1: cannot open shared object file: No such file or directory

Regards
Venkat
 
  


Reply


Thread Tools Search this Thread
Search this Thread:

Advanced Search

Posting Rules
You may not post new threads
You may not post replies
You may not post attachments
You may not edit your posts

BB code is On
Smilies are On
[IMG] code is Off
HTML code is Off


Similar Threads
Thread Thread Starter Forum Replies Last Post
Problems compiling Enlightenment 0.16.7 Erik_the_Red Linux - Software 3 08-25-2007 09:17 AM
g++ compiling issue k1ll3r_x Programming 3 05-03-2005 02:26 AM
gtk-2.0 themes, enlightenment/eterm issue Aman9090 Linux - Software 1 02-01-2004 11:10 PM
Anjuta compiling issue in Slack 9... JoooN Slackware 4 04-16-2003 09:19 PM
Enlightenment Issue lowlifeish Linux - Software 2 11-01-2002 02:11 PM


All times are GMT -5. The time now is 12:20 PM.

Main Menu
Advertisement
My LQ
Write for LQ
LinuxQuestions.org is looking for people interested in writing Editorials, Articles, Reviews, and more. If you'd like to contribute content, let us know.
Main Menu
Syndicate
RSS1  Latest Threads
RSS1  LQ News
Twitter: @linuxquestions
identi.ca: @linuxquestions
Facebook: linuxquestions Google+: linuxquestions
Open Source Consulting | Domain Registration