LinuxQuestions.org
LinuxAnswers - the LQ Linux tutorial section.
Go Back   LinuxQuestions.org > Forums > Linux Forums > Linux - Software
User Name
Password
Linux - Software This forum is for Software issues.
Having a problem installing a new program? Want to know which application is best for the job? Post your question in this forum.

Notices



Reply
 
Search this Thread
Old 06-02-2006, 01:41 PM   #1
crewblunts
Member
 
Registered: Jan 2004
Location: Connecticut, USA
Distribution: Slackware & Ubuntu
Posts: 53

Rep: Reputation: 15
Engage compile error, index out of range


Hi all,
I am trying to install engage on E17 window manager. I tried the module and got a module.so not found error. So now I am compiling the source I downloaded from cvs. However I keep getting this error:

Code:
/usr/local/bin/edje_cc -v module_icon.edc module.eap
/usr/local/bin/edje_cc: Opening "/tmp/edje_cc.edc-tmp-Tw0NO6" for input
/usr/local/bin/edje_cc: Parsing input file
/usr/local/bin/edje_cc: Error. <stdin>:7 unexpected character at %d
/usr/local/bin/edje_cc: Error. <stdin>:7 integer -1214922512 out of range of 0 to 2147483647 inclusive
make[3]: *** [module.eap] Error 255
make[3]: Leaving directory `/home/admin/enlightenment/misc/engage/src/module'
make[2]: *** [all-recursive] Error 1
make[2]: Leaving directory `/home/admin/enlightenment/misc/engage/src'
make[1]: *** [all-recursive] Error 1
make[1]: Leaving directory `/home/admin/enlightenment/misc/engage'
make: *** [all] Error 2
Any ideas or help would be much appreciated.

Thanks in advance,

Phil V
 
Old 06-04-2006, 04:34 PM   #2
crewblunts
Member
 
Registered: Jan 2004
Location: Connecticut, USA
Distribution: Slackware & Ubuntu
Posts: 53

Original Poster
Rep: Reputation: 15
For anyone who finds this thread I fixed the problem. I compiled and installed a newer gcc version. I had 3.5(came with slack) and I upgraded to 4.1.1

hope that helps someone in the future
 
  


Reply


Thread Tools Search this Thread
Search this Thread:

Advanced Search

Posting Rules
You may not post new threads
You may not post replies
You may not post attachments
You may not edit your posts

BB code is On
Smilies are On
[IMG] code is Off
HTML code is Off


Similar Threads
Thread Thread Starter Forum Replies Last Post
HV Frequency out of Range error? dolphans1 Mandriva 7 08-12-2010 11:40 PM
Index was out of range. Must be non-negative and less than the size of the collectio mrobertson Programming 2 03-15-2006 11:47 AM
KDE 3.5 Search index creation error Phyrexicaid Linux - Software 0 01-13-2006 03:56 AM
RPM error cannot open Group index... humbletech99 Suse/Novell 4 12-21-2005 04:22 AM
PHP Undefined index Error Gerardoj Programming 1 05-30-2004 04:30 AM


All times are GMT -5. The time now is 08:11 PM.

Main Menu
Advertisement
My LQ
Write for LQ
LinuxQuestions.org is looking for people interested in writing Editorials, Articles, Reviews, and more. If you'd like to contribute content, let us know.
Main Menu
Syndicate
RSS1  Latest Threads
RSS1  LQ News
Twitter: @linuxquestions
identi.ca: @linuxquestions
Facebook: linuxquestions Google+: linuxquestions
Open Source Consulting | Domain Registration