LinuxQuestions.org
View the Most Wanted LQ Wiki articles.
Go Back   LinuxQuestions.org > Forums > Linux Forums > Linux - Software
User Name
Password
Linux - Software This forum is for Software issues.
Having a problem installing a new program? Want to know which application is best for the job? Post your question in this forum.

Notices



Reply
 
Search this Thread
Old 07-23-2009, 01:02 PM   #1
lukeiamyourfather
Member
 
Registered: Jul 2007
Distribution: Ubuntu, LFS, Fedora
Posts: 30

Rep: Reputation: 15
Angry E17 - Evas Compile issues


Hi all,

I'm trying to install E17 using easy_e17.sh, and I've done it before, the only issues being dependencies, and once they were satisfied, I just ran the script again.

Code:
libtool: compile:  gcc -DHAVE_CONFIG_H -I. -I../../../.. -I. -I../../../../src/lib -I../../../../src/lib/include -I../../../../src/modules/engines -I../../../../src/modules/engines/software_16 -I/usr/include/freetype2 -I/opt/e17/include/eina-0 -I/opt/e17/include/eina-0/eina -I/opt/e17/include -D_GNU_SOURCE -MT module_la-evas_x_buffer.lo -MD -MP -MF .deps/module_la-evas_x_buffer.Tpo -c evas_x_buffer.c  -fPIC -DPIC -o .libs/module_la-evas_x_buffer.o
In file included from evas_x_buffer.c:2:
evas_engine.h:7:33: error: X11/extensions/XShm.h: No such file or directory
In file included from evas_engine.c:3:
evas_engine.h:7:33: error: X11/extensions/XShm.h: No such file or directory
In file included from evas_engine.c:3:
evas_engine.h:20: error: expected specifier-qualifier-list before ‘XShmSegmentInfo’
In file included from evas_x_buffer.c:2:
evas_engine.h:20: error: expected specifier-qualifier-list before ‘XShmSegmentInfo’
evas_x_buffer.c: In function ‘evas_software_x11_x_output_buffer_new’:
evas_x_buffer.c:51: error: ‘X_Output_Buffer’ has no member named ‘shm_info’
evas_x_buffer.c:55: error: ‘X_Output_Buffer’ has no member named ‘shm_info’
evas_x_buffer.c:55: error: ‘XShmSegmentInfo’ undeclared (first use in this function)
evas_x_buffer.c:55: error: (Each undeclared identifier is reported only once
evas_x_buffer.c:55: error: for each function it appears in.)
evas_x_buffer.c:56: error: ‘X_Output_Buffer’ has no member named ‘shm_info’
evas_x_buffer.c:59: error: ‘X_Output_Buffer’ has no member named ‘shm_info’
evas_x_buffer.c:59: warning: assignment makes pointer from integer without a cast
evas_x_buffer.c:62: error: ‘X_Output_Buffer’ has no member named ‘shm_info’
evas_x_buffer.c:66: error: ‘X_Output_Buffer’ has no member named ‘shm_info’
evas_x_buffer.c:68: error: ‘X_Output_Buffer’ has no member named ‘shm_info’
evas_x_buffer.c:69: error: ‘X_Output_Buffer’ has no member named ‘shm_info’
evas_x_buffer.c:70: error: ‘X_Output_Buffer’ has no member named ‘shm_info’
evas_x_buffer.c:71: error: ‘X_Output_Buffer’ has no member named ‘shm_info’
evas_x_buffer.c:79: error: ‘X_Output_Buffer’ has no member named ‘shm_info’
evas_x_buffer.c:90: error: ‘X_Output_Buffer’ has no member named ‘shm_info’
evas_x_buffer.c:91: error: ‘X_Output_Buffer’ has no member named ‘shm_info’
evas_x_buffer.c:96: error: ‘X_Output_Buffer’ has no member named ‘shm_info’
evas_x_buffer.c:96: error: ‘X_Output_Buffer’ has no member named ‘shm_info’
evas_x_buffer.c:97: error: ‘X_Output_Buffer’ has no member named ‘shm_info’
evas_x_buffer.c:110: error: ‘X_Output_Buffer’ has no member named ‘data’
evas_x_buffer.c: In function ‘evas_software_x11_x_output_buffer_free’:
evas_x_buffer.c:134: error: ‘X_Output_Buffer’ has no member named ‘shm_info’
evas_x_buffer.c:137: error: ‘X_Output_Buffer’ has no member named ‘shm_info’
evas_x_buffer.c:139: error: ‘X_Output_Buffer’ has no member named ‘shm_info’
evas_x_buffer.c:140: error: ‘X_Output_Buffer’ has no member named ‘shm_info’
evas_x_buffer.c:141: error: ‘X_Output_Buffer’ has no member named ‘shm_info’
evas_x_buffer.c:145: error: ‘X_Output_Buffer’ has no member named ‘data’
evas_x_buffer.c: In function ‘evas_software_x11_x_output_buffer_paste’:
evas_x_buffer.c:154: error: ‘X_Output_Buffer’ has no member named ‘shm_info’
make[5]: *** [module_la-evas_x_buffer.lo] Error 1
make[5]: *** Waiting for unfinished jobs....
make[5]: *** [module_la-evas_engine.lo] Error 1
make[5]: Leaving directory `/home/christopher/e17_src/evas/src/modules/engines/software_16_x11'
make[4]: *** [all-recursive] Error 1
make[4]: Leaving directory `/home/christopher/e17_src/evas/src/modules/engines'
make[3]: *** [all-recursive] Error 1
make[3]: Leaving directory `/home/christopher/e17_src/evas/src/modules'
make[2]: *** [all-recursive] Error 1
make[2]: Leaving directory `/home/christopher/e17_src/evas/src'
make[1]: *** [all-recursive] Error 1
make[1]: Leaving directory `/home/christopher/e17_src/evas'
make: *** [all] Error 2


I'm on Ubuntu 9.04. Sorry for the long post!

Thanks, Chris
 
Old 07-24-2009, 11:57 PM   #2
weibullguy
ReliaFree Maintainer
 
Registered: Aug 2004
Location: Kalamazoo, Michigan
Distribution: Slackware-current, Cross Linux from Scratch, Gentoo
Posts: 2,753
Blog Entries: 1

Rep: Reputation: 238Reputation: 238Reputation: 238
Quote:
Originally Posted by lukeiamyourfather View Post
Code:
evas_engine.h:7:33: error: X11/extensions/XShm.h: No such file or directory
Seems pretty straight forward to me. According to this page, XShm.h is provided by x11proto-xext-dev on Ubuntu.
 
Old 07-27-2009, 09:25 AM   #3
lukeiamyourfather
Member
 
Registered: Jul 2007
Distribution: Ubuntu, LFS, Fedora
Posts: 30

Original Poster
Rep: Reputation: 15
Oh, I wasn't paying attention. My bad. Thanks
 
  


Reply

Tags
e17, enlightenment


Thread Tools Search this Thread
Search this Thread:

Advanced Search

Posting Rules
You may not post new threads
You may not post replies
You may not post attachments
You may not edit your posts

BB code is On
Smilies are On
[IMG] code is Off
HTML code is Off


Similar Threads
Thread Thread Starter Forum Replies Last Post
E17 from CVS compile error. Debain 3.1r1 all updates Dimitriy Debian 1 01-07-2006 04:10 PM
E17 compile error edje cannot find "brushed.png" inkysplat Linux - Software 1 01-06-2006 01:48 AM
Compiling Evas (E17) - /usr/bin/ld: cannot find -lvga victorhooi Linux - Software 1 10-20-2005 05:33 PM
Compile Issues Megadeth08902 Linux - Software 1 02-18-2005 10:49 PM
COMPILE issues meindlj Linux - Software 0 05-18-2004 05:43 PM


All times are GMT -5. The time now is 07:16 AM.

Main Menu
Advertisement
My LQ
Write for LQ
LinuxQuestions.org is looking for people interested in writing Editorials, Articles, Reviews, and more. If you'd like to contribute content, let us know.
Main Menu
Syndicate
RSS1  Latest Threads
RSS1  LQ News
Twitter: @linuxquestions
identi.ca: @linuxquestions
Facebook: linuxquestions Google+: linuxquestions
Open Source Consulting | Domain Registration