LinuxQuestions.org
Go Job Hunting at the LQ Job Marketplace
Go Back   LinuxQuestions.org > Forums > Linux Forums > Linux - Software
User Name
Password
Linux - Software This forum is for Software issues.
Having a problem installing a new program? Want to know which application is best for the job? Post your question in this forum.

Notices

Reply
 
Search this Thread
Old 07-09-2005, 07:35 AM   #1
inkysplat
LQ Newbie
 
Registered: Oct 2003
Location: Bristol, UK
Distribution: Ubuntu Breezy Badger
Posts: 26

Rep: Reputation: 15
E17 compile error edje cannot find "brushed.png"


i've compiled enlightenment 0.17 from http://enlightenment.freedesktop.org, i've compiled it all in order. I'm running Ubuntu Hoary. I've tried recompiling it all a few times and still no luck. Heres the output code:

/usr/local/bin/edje_cc: Error. unable to load image for image "brushed.png" part entry to ../../data/init/init.edj
make[4]: *** [init.edj] Error 255
make[4]: Leaving directory `/home/inkysplat/Desktop/enlightenment-0.16.999.010/data/init'
make[3]: *** [all-recursive] Error 1
make[3]: Leaving directory `/home/inkysplat/Desktop/enlightenment-0.16.999.010/data/init'
make[2]: *** [all-recursive] Error 1
make[2]: Leaving directory `/home/inkysplat/Desktop/enlightenment-0.16.999.010/data'
make[1]: *** [all-recursive] Error 1
make[1]: Leaving directory `/home/inkysplat/Desktop/enlightenment-0.16.999.010'make: *** [all-recursive-am] Error 2

Any help is appreaciated.

Thanks
 
Old 01-06-2006, 12:48 AM   #2
Dimitriy
Member
 
Registered: Oct 2005
Distribution: Ubuntu Dapper (6.06)
Posts: 92

Rep: Reputation: 15
Same here running Debian 3.1r1 stable (Sarge).

Same error and everything. Any help???
 
  


Reply


Thread Tools Search this Thread
Search this Thread:

Advanced Search

Posting Rules
You may not post new threads
You may not post replies
You may not post attachments
You may not edit your posts

BB code is On
Smilies are On
[IMG] code is Off
HTML code is Off


Similar Threads
Thread Thread Starter Forum Replies Last Post
Shell Script: Find "Word" Run "Command" granatica Linux - Software 5 07-25-2007 07:42 AM
Can't install "glibmm" library. "configure" script can't find "sigc++-2.0&q kornerr Linux - General 4 05-10-2005 02:32 PM
UT demo error: "Can't find file for package 'SDLGLDrv'" r_jensen11 Linux - Software 2 04-13-2004 09:49 PM
Just finished compiling Wine, getting "couldn't find program" error Maronflower Linux - Software 1 11-10-2003 06:50 PM
ncurses compile error: "undefined reference" Mr. Eek Linux From Scratch 1 05-12-2003 04:25 PM


All times are GMT -5. The time now is 01:04 PM.

Main Menu
My LQ
Write for LQ
LinuxQuestions.org is looking for people interested in writing Editorials, Articles, Reviews, and more. If you'd like to contribute content, let us know.
Main Menu
Syndicate
RSS1  Latest Threads
RSS1  LQ News
Twitter: @linuxquestions
identi.ca: @linuxquestions
Facebook: linuxquestions Google+: linuxquestions
Open Source Consulting | Domain Registration