LinuxQuestions.org
Latest LQ Deal: Complete CCNA, CCNP & Red Hat Certification Training Bundle
Go Back   LinuxQuestions.org > Forums > Linux Forums > Linux - Software
User Name
Password
Linux - Software This forum is for Software issues.
Having a problem installing a new program? Want to know which application is best for the job? Post your question in this forum.

Notices


Reply
  Search this Thread
Old 07-24-2002, 05:30 PM   #1
tied2
Member
 
Registered: Jun 2002
Location: Florida
Distribution: Redhat, FreeBSD, FC 6
Posts: 220

Rep: Reputation: 30
Thumbs down ./configure What am i doing wrong?


I can't get ./configure to run i'm sure it's some simple command I'm over looking. Please look at this terminal copy and tell where I'm going wrong.

[root@localhost Downloads]# tar -zxvf firewalk-0.99.1.tar.gz
Firewalk-0.99.1/
Firewalk-0.99.1/CVS/
Firewalk-0.99.1/CVS/Root
Firewalk-0.99.1/CVS/Repository
Firewalk-0.99.1/CVS/Entries
Firewalk-0.99.1/Makefile.in
Firewalk-0.99.1/README
Firewalk-0.99.1/VERSION
Firewalk-0.99.1/acconfig.h
Firewalk-0.99.1/aclocal.m4
Firewalk-0.99.1/config.guess
Firewalk-0.99.1/config.h.in
Firewalk-0.99.1/config.sub
Firewalk-0.99.1/configure
Firewalk-0.99.1/configure.in
Firewalk-0.99.1/firepack.h
Firewalk-0.99.1/firewalk.1
Firewalk-0.99.1/firewalk.c
Firewalk-0.99.1/firewalk.h
Firewalk-0.99.1/firewalk.xpm
Firewalk-0.99.1/gtk_cb.c
Firewalk-0.99.1/gtk_cb.h
Firewalk-0.99.1/gtk_cp.c
Firewalk-0.99.1/gtk_cp.h
Firewalk-0.99.1/gtk_itemfactory.h
Firewalk-0.99.1/gtk_main.c
Firewalk-0.99.1/gtk_main.h
Firewalk-0.99.1/gtk_pack.h
Firewalk-0.99.1/gtk_util.c
Firewalk-0.99.1/gtk_util.h
Firewalk-0.99.1/install-sh
Firewalk-0.99.1/main.c
Firewalk-0.99.1/main.h
Firewalk-0.99.1/p_cap.c
Firewalk-0.99.1/p_cap.h
Firewalk-0.99.1/packet.c
Firewalk-0.99.1/packet.h
Firewalk-0.99.1/port_list.c
Firewalk-0.99.1/port_list.h
Firewalk-0.99.1/signal.c
Firewalk-0.99.1/signal.h
Firewalk-0.99.1/udptcpwalk.c
Firewalk-0.99.1/unreachables.h
Firewalk-0.99.1/util.c
Firewalk-0.99.1/util.h
Firewalk-0.99.1/watcher.c
Firewalk-0.99.1/watcher.h
[root@localhost Downloads]# ./configure
bash: ./configure: No such file or directory
[root@localhost Downloads]# cd /root/Downloads/firewalk-0.99.1
bash: cd: /root/Downloads/firewalk-0.99.1: No such file or directory
[root@localhost Downloads]# cd /root/Downloads/firewalk-0.99.1
bash: cd: /root/Downloads/firewalk-0.99.1: No such file or directory
[root@localhost Downloads]# cd /firewalk-0.99.1
bash: cd: /firewalk-0.99.1: No such file or directory
[root@localhost Downloads]# cd /firewalk-0.99.1/
bash: cd: /firewalk-0.99.1/: No such file or directory
[root@localhost Downloads]# cd /firewalk-0.99.1/CVS
bash: cd: /firewalk-0.99.1/CVS: No such file or directory
[root@localhost Downloads]# cd /what am I doing wrong?
 
Old 07-24-2002, 05:47 PM   #2
BruceCadieux
Member
 
Registered: Apr 2002
Location: Wales MA.
Distribution: openSuSE 11.1
Posts: 409

Rep: Reputation: 32
cd /Firewalk-0.99.1

Linux is case sensative
 
Old 07-24-2002, 06:19 PM   #3
tied2
Member
 
Registered: Jun 2002
Location: Florida
Distribution: Redhat, FreeBSD, FC 6
Posts: 220

Original Poster
Rep: Reputation: 30
ok I'm there but it still didn't work ? am i missing a file?

[root@localhost Downloads]# cd /root/Downloads/Firewalk-0.99.1/
[root@localhost Firewalk-0.99.1]# ./configure
creating cache ./config.cache
checking host system type... i686-pc-linux-gnu
checking target system type... i686-pc-linux-gnu
checking build system type... i686-pc-linux-gnu
checking for gcc... gcc
checking whether the C compiler (gcc -O3 -funroll-loops -fomit-frame-pointer -pipe ) works... yes
checking whether the C compiler (gcc -O3 -funroll-loops -fomit-frame-pointer -pipe ) is a cross-compiler... no
checking whether we are using GNU C... yes
checking whether gcc accepts -g... yes
checking how to run the C preprocessor... gcc -E
checking for a BSD compatible install... /usr/bin/install -c
checking for libnet_build_ip in -lnet... no
configure: error: No libnet? No firewalk.
[root@localhost Firewalk-0.99.1]# make
make: *** No targets specified and no makefile found. Stop.
 
Old 07-24-2002, 07:03 PM   #4
tied2
Member
 
Registered: Jun 2002
Location: Florida
Distribution: Redhat, FreeBSD, FC 6
Posts: 220

Original Poster
Rep: Reputation: 30
ok I found libnet and installed it no problems now i'm getting some kinda error??? any ideas anyone?

[root@localhost root]# cd /root/Downloads/Firewalk-0.99.1/
[root@localhost Firewalk-0.99.1]# ./configure
loading cache ./config.cache
checking host system type... i686-pc-linux-gnu
checking target system type... i686-pc-linux-gnu
checking build system type... i686-pc-linux-gnu
checking for gcc... (cached) gcc
checking whether the C compiler (gcc -O3 -funroll-loops -fomit-frame-pointer -pipe ) works... yes
checking whether the C compiler (gcc -O3 -funroll-loops -fomit-frame-pointer -pipe ) is a cross-compiler... no
checking whether we are using GNU C... (cached) yes
checking whether gcc accepts -g... (cached) yes
checking how to run the C preprocessor... (cached) gcc -E
checking for a BSD compatible install... (cached) /usr/bin/install -c
checking for libnet_build_ip in -lnet... (cached) yes
checking for pcap_open_live in -lpcap... (cached) yes
checking for gtk-config... (cached) /usr/bin/gtk-config
checking for GTK - version >= 1.0.0... yes
checking for ANSI C header files... (cached) yes
checking for working const... (cached) yes
checking whether gcc needs -traditional... (cached) no
checking for strerror... (cached) yes
creating ./config.status
creating Makefile
creating config.h
config.h is unchanged
[root@localhost Firewalk-0.99.1]# make
cc -O3 -funroll-loops -fomit-frame-pointer -pipe -DHAVE_CONFIG_H `libnet-config --defines` -c main.c -o main.o
In file included from main.c:38:
main.h:47:18: pcap.h: No such file or directory
In file included from firewalk.h:38,
from main.c:39:
firepack.h:38:18: pcap.h: No such file or directory
In file included from firepack.h:41,
from firewalk.h:38,
from main.c:39:
gtk_main.h:37:21: gtk/gtk.h: No such file or directory
In file included from main.c:46:
gtk_pack.h:37:21: gtk/gtk.h: No such file or directory
In file included from firepack.h:41,
from firewalk.h:38,
from main.c:39:
gtk_main.h:52: parse error before `GtkWidget'
gtk_main.h:52: warning: no semicolon at end of struct or union
gtk_main.h:53: warning: data definition has no type or storage class
gtk_main.h:54: parse error before `*'
gtk_main.h:54: warning: data definition has no type or storage class
gtk_main.h:55: parse error before `*'
gtk_main.h:55: warning: data definition has no type or storage class
gtk_main.h:56: parse error before `}'
In file included from firewalk.h:38,
from main.c:39:
firepack.h:79: parse error before `pcap_t'
firepack.h:79: warning: no semicolon at end of struct or union
firepack.h:81: warning: built-in function `sin' declared as non-function
firepack.h:82: parse error before `}'
In file included from packet.h:38,
from main.c:42:
p_cap.h:66: `PCAP_ERRBUF_SIZE' undeclared here (not in a function)
p_cap.h:72: parse error before `*'
p_cap.h:78: warning: data definition has no type or storage class
p_cap.h:83: parse error before `*'
p_cap.h:104: parse error before `*'
In file included from main.c:46:
gtk_pack.h:44: parse error before `GtkWidget'
gtk_pack.h:44: warning: no semicolon at end of struct or union
gtk_pack.h:45: warning: data definition has no type or storage class
gtk_pack.h:46: parse error before `*'
gtk_pack.h:46: warning: data definition has no type or storage class
gtk_pack.h:47: parse error before `*'
gtk_pack.h:47: warning: data definition has no type or storage class
gtk_pack.h:48: parse error before `*'
gtk_pack.h:48: warning: data definition has no type or storage class
gtk_pack.h:53: parse error before `*'
gtk_pack.h:53: warning: data definition has no type or storage class
gtk_pack.h:54: parse error before `*'
gtk_pack.h:54: warning: data definition has no type or storage class
gtk_pack.h:55: parse error before `*'
gtk_pack.h:55: warning: data definition has no type or storage class
gtk_pack.h:56: parse error before `*'
gtk_pack.h:56: warning: data definition has no type or storage class
gtk_pack.h:57: parse error before `*'
gtk_pack.h:57: warning: data definition has no type or storage class
gtk_pack.h:58: parse error before `*'
gtk_pack.h:58: warning: data definition has no type or storage class
gtk_pack.h:59: parse error before `*'
gtk_pack.h:59: warning: data definition has no type or storage class
gtk_pack.h:60: parse error before `*'
gtk_pack.h:60: warning: data definition has no type or storage class
gtk_pack.h:61: parse error before `*'
gtk_pack.h:61: warning: data definition has no type or storage class
gtk_pack.h:62: parse error before `*'
gtk_pack.h:62: warning: data definition has no type or storage class
gtk_pack.h:63: parse error before `*'
gtk_pack.h:63: warning: data definition has no type or storage class
gtk_pack.h:64: parse error before `*'
gtk_pack.h:64: warning: data definition has no type or storage class
gtk_pack.h:65: parse error before `}'
main.c: In function `main':
main.c:98: dereferencing pointer to incomplete type
main.c:101: dereferencing pointer to incomplete type
main.c:104: dereferencing pointer to incomplete type
main.c:113: dereferencing pointer to incomplete type
main.c:114: dereferencing pointer to incomplete type
main.c:124: dereferencing pointer to incomplete type
main.c:134: dereferencing pointer to incomplete type
main.c:137: dereferencing pointer to incomplete type
main.c:158: dereferencing pointer to incomplete type
main.c:168: dereferencing pointer to incomplete type
main.c:185: dereferencing pointer to incomplete type
main.c:195: dereferencing pointer to incomplete type
main.c:205: dereferencing pointer to incomplete type
main.c:218: dereferencing pointer to incomplete type
main.c:229: dereferencing pointer to incomplete type
main.c:229: dereferencing pointer to incomplete type
main.c:240: dereferencing pointer to incomplete type
main.c:248: dereferencing pointer to incomplete type
main.c:256: dereferencing pointer to incomplete type
main.c:264: dereferencing pointer to incomplete type
main.c:266: dereferencing pointer to incomplete type
main.c:266: dereferencing pointer to incomplete type
main.c:266: dereferencing pointer to incomplete type
main.c:275: dereferencing pointer to incomplete type
main.c:276: dereferencing pointer to incomplete type
main.c:285: dereferencing pointer to incomplete type
main.c: At top level:
p_cap.h:66: storage size of `errbuf' isn't known
make: *** [main.o] Error 1
 
Old 07-24-2002, 07:05 PM   #5
tied2
Member
 
Registered: Jun 2002
Location: Florida
Distribution: Redhat, FreeBSD, FC 6
Posts: 220

Original Poster
Rep: Reputation: 30
Are these gtk errors??? I'm allways having problems with gtk stuff. Firestarter GUI wont work because of Gtk errors? any ideas? maybe this should be posted in the Programers forum.
 
Old 07-24-2002, 07:10 PM   #6
tied2
Member
 
Registered: Jun 2002
Location: Florida
Distribution: Redhat, FreeBSD, FC 6
Posts: 220

Original Poster
Rep: Reputation: 30
I have Gtk version 1.0.0 I think or what ever comes with RH 7.3 theres a Gtk version 2.0.5 now. Should I download it and install?? maybe this will fix my problems??? ya recon?
 
Old 07-24-2002, 07:23 PM   #7
zelgadis
Member
 
Registered: Apr 2002
Location: Venezuela
Distribution: slackware 8.0
Posts: 67

Rep: Reputation: 15
From the logs it seems that you don't have some files:

main.h:47:18: pcap.h: No such file or directory

gtk_main.h:37:21: gtk/gtk.h: No such file or directory

And other files have some errors:

gtk_pack.h:44: warning: no semicolon at end of struct or union
gtk_pack.h:45: warning: data definition has no type or storage class


I think maybe your download is incomplete or corrupted, so you can compare
the size of your download against the original, or download it again,
if possible from other mirror.


Hope this help. . . . . . ^_^
 
Old 07-24-2002, 08:20 PM   #8
tied2
Member
 
Registered: Jun 2002
Location: Florida
Distribution: Redhat, FreeBSD, FC 6
Posts: 220

Original Poster
Rep: Reputation: 30
Ok I went to the web site www.packetfactory.net and found a supposed fix I copyed the correct files to the correct dir. and no go still. so I downloaded anewer version wit ha fix and it didn't work same type errors. so i down loaded a older version with no GUI and it didn't work same type errors . here are the errors for the version i want firewalk 1.0

root@localhost root]# cd /root/Downloads/Firewalk-1.0/
[root@localhost Firewalk-1.0]# ./configure
loading cache ./config.cache
checking host system type... i686-pc-linux-gnu
checking target system type... i686-pc-linux-gnu
checking build system type... i686-pc-linux-gnu
checking for gcc... (cached) gcc
checking whether the C compiler (gcc -O3 -funroll-loops -fomit-frame-pointer -pipe ) works... yes
checking whether the C compiler (gcc -O3 -funroll-loops -fomit-frame-pointer -pipe ) is a cross-compiler... no
checking whether we are using GNU C... (cached) yes
checking whether gcc accepts -g... (cached) yes
checking how to run the C preprocessor... (cached) gcc -E
checking for a BSD compatible install... (cached) /usr/bin/install -c
checking for libnet_build_ip in -lnet... (cached) yes
checking for pcap_open_live in -lpcap... (cached) yes
checking for gtk-config... (cached) /usr/bin/gtk-config
checking for GTK - version >= 1.0.0... yes
checking for ANSI C header files... (cached) yes
checking for working const... (cached) yes
checking whether gcc needs -traditional... (cached) no
checking for strerror... (cached) yes
creating ./config.status
creating Makefile
creating config.h
config.h is unchanged
[root@localhost Firewalk-1.0]# make
cc -O3 -funroll-loops -fomit-frame-pointer -pipe -DHAVE_CONFIG_H `libnet-config --defines` -c main.c -o main.o
In file included from main.c:38:
main.h:47:18: pcap.h: No such file or directory
In file included from firewalk.h:38,
from main.c:39:
firepack.h:38:18: pcap.h: No such file or directory
In file included from firepack.h:41,
from firewalk.h:38,
from main.c:39:
gtk_main.h:37:21: gtk/gtk.h: No such file or directory
In file included from main.c:46:
gtk_pack.h:37:21: gtk/gtk.h: No such file or directory
In file included from firepack.h:41,
from firewalk.h:38,
from main.c:39:
gtk_main.h:52: parse error before `GtkWidget'
gtk_main.h:52: warning: no semicolon at end of struct or union
gtk_main.h:53: warning: data definition has no type or storage class
gtk_main.h:54: parse error before `*'
gtk_main.h:54: warning: data definition has no type or storage class
gtk_main.h:55: parse error before `*'
gtk_main.h:55: warning: data definition has no type or storage class
gtk_main.h:56: parse error before `}'
In file included from firewalk.h:38,
from main.c:39:
firepack.h:79: parse error before `pcap_t'
firepack.h:79: warning: no semicolon at end of struct or union
firepack.h:81: warning: built-in function `sin' declared as non-function
firepack.h:82: parse error before `}'
In file included from packet.h:38,
from main.c:42:
p_cap.h:66: `PCAP_ERRBUF_SIZE' undeclared here (not in a function)
p_cap.h:72: parse error before `*'
p_cap.h:78: warning: data definition has no type or storage class
p_cap.h:83: parse error before `*'
p_cap.h:104: parse error before `*'
In file included from main.c:46:
gtk_pack.h:44: parse error before `GtkWidget'
gtk_pack.h:44: warning: no semicolon at end of struct or union
gtk_pack.h:45: warning: data definition has no type or storage class
gtk_pack.h:46: parse error before `*'
gtk_pack.h:46: warning: data definition has no type or storage class
gtk_pack.h:47: parse error before `*'
gtk_pack.h:47: warning: data definition has no type or storage class
gtk_pack.h:48: parse error before `*'
gtk_pack.h:48: warning: data definition has no type or storage class
gtk_pack.h:53: parse error before `*'
gtk_pack.h:53: warning: data definition has no type or storage class
gtk_pack.h:54: parse error before `*'
gtk_pack.h:54: warning: data definition has no type or storage class
gtk_pack.h:55: parse error before `*'
gtk_pack.h:55: warning: data definition has no type or storage class
gtk_pack.h:56: parse error before `*'
gtk_pack.h:56: warning: data definition has no type or storage class
gtk_pack.h:57: parse error before `*'
gtk_pack.h:57: warning: data definition has no type or storage class
gtk_pack.h:58: parse error before `*'
gtk_pack.h:58: warning: data definition has no type or storage class
gtk_pack.h:59: parse error before `*'
gtk_pack.h:59: warning: data definition has no type or storage class
gtk_pack.h:60: parse error before `*'
gtk_pack.h:60: warning: data definition has no type or storage class
gtk_pack.h:61: parse error before `*'
gtk_pack.h:61: warning: data definition has no type or storage class
gtk_pack.h:62: parse error before `*'
gtk_pack.h:62: warning: data definition has no type or storage class
gtk_pack.h:63: parse error before `*'
gtk_pack.h:63: warning: data definition has no type or storage class
gtk_pack.h:64: parse error before `*'
gtk_pack.h:64: warning: data definition has no type or storage class
gtk_pack.h:65: parse error before `}'
main.c: In function `main':
main.c:98: dereferencing pointer to incomplete type
main.c:101: dereferencing pointer to incomplete type
main.c:104: dereferencing pointer to incomplete type
main.c:113: dereferencing pointer to incomplete type
main.c:114: dereferencing pointer to incomplete type
main.c:124: dereferencing pointer to incomplete type
main.c:134: dereferencing pointer to incomplete type
main.c:137: dereferencing pointer to incomplete type
main.c:158: dereferencing pointer to incomplete type
main.c:168: dereferencing pointer to incomplete type
main.c:185: dereferencing pointer to incomplete type
main.c:195: dereferencing pointer to incomplete type
main.c:205: dereferencing pointer to incomplete type
main.c:218: dereferencing pointer to incomplete type
main.c:229: dereferencing pointer to incomplete type
main.c:229: dereferencing pointer to incomplete type
main.c:240: dereferencing pointer to incomplete type
main.c:248: dereferencing pointer to incomplete type
main.c:256: dereferencing pointer to incomplete type
main.c:264: dereferencing pointer to incomplete type
main.c:266: dereferencing pointer to incomplete type
main.c:266: dereferencing pointer to incomplete type
main.c:266: dereferencing pointer to incomplete type
main.c:275: dereferencing pointer to incomplete type
main.c:276: dereferencing pointer to incomplete type
main.c:285: dereferencing pointer to incomplete type
main.c: At top level:
p_cap.h:66: storage size of `errbuf' isn't known
make: *** [main.o] Error 1
[root@localhost Firewalk-1.0]#
 
Old 07-24-2002, 11:44 PM   #9
neo77777
LQ Addict
 
Registered: Dec 2001
Location: Brooklyn, NY
Distribution: *NIX
Posts: 3,704

Rep: Reputation: 56
I tried to compile Firewalk the other day and I got the same errors, except I had libcap, libcap-devel installed, so I got the same errors as in your last post, then I went into source files to look what's up, and I believe if you downgrade your libpcap to 0.4 it should be fine, but I don't feel like getting an older package, and then recompile ethereal, snort, etc. on my system because they rely on libpcap shared object file.
 
Old 09-01-2002, 11:36 PM   #10
fjaplit
LQ Newbie
 
Registered: Aug 2002
Posts: 1

Rep: Reputation: 0
Unhappy Libnet Library problem

I'm have the same problem the Tied2 had with the Libnet installation. I get a no libnet no firewalk error when trying to install firewalk.

I installed libnet from the /opt/Libnet-latest directory and had no problems. However, I don't believe that I am configuring the link to the libnet library properly. I've added the line /opt/Libnet-latest/src to /etc/ld.so.conf file and ran ldconfig from the directory. However, I still get the no libnet no firewalk error from the ./configure from the Firewalk portion of the installation.
 
Old 09-16-2002, 06:02 PM   #11
L7sniper
LQ Newbie
 
Registered: Sep 2002
Posts: 1

Rep: Reputation: 0
Post Firewalk on RH 7.3

Hmm...Down grading would do it. C skills really rusty. But trying to compile Firewalk on RH 7.3 latest Kernel build....

My autoconf rolls fine and no erros...But my sys is having problems with the included header files...It can find them...Here is the compile err...Any help / insight would be appreciated.

cc -O3 -funroll-loops -fomit-frame-pointer -pipe -DHAVE_CONFIG_H `libnet-config --defines` -c main.c -o main.o
In file included from main.c:38:
main.h:47:18: pcap.h: No such file or directory
In file included from firewalk.h:38,
from main.c:39:
firepack.h:38:18: pcap.h: No such file or directory
In file included from firepack.h:41,
from firewalk.h:38,
from main.c:39:
gtk_main.h:37:21: gtk/gtk.h: No such file or directory
In file included from main.c:46:
gtk_pack.h:37:21: gtk/gtk.h: No such file or directory
In file included from firepack.h:41,
from firewalk.h:38,
from main.c:39:
gtk_main.h:52: parse error before `GtkWidget'
gtk_main.h:52: warning: no semicolon at end of struct or union
gtk_main.h:53: warning: data definition has no type or storage class
gtk_main.h:54: parse error before `*'
gtk_main.h:54: warning: data definition has no type or storage class
gtk_main.h:55: parse error before `*'
gtk_main.h:55: warning: data definition has no type or storage class
gtk_main.h:56: parse error before `}'
In file included from firewalk.h:38,
from main.c:39:
firepack.h:79: parse error before `pcap_t'
firepack.h:79: warning: no semicolon at end of struct or union
firepack.h:81: warning: built-in function `sin' declared as non-function
firepack.h:82: parse error before `}'
In file included from packet.h:38,
from main.c:42:
p_cap.h:66: `PCAP_ERRBUF_SIZE' undeclared here (not in a function)
p_cap.h:72: parse error before `*'
p_cap.h:78: warning: data definition has no type or storage class
p_cap.h:83: parse error before `*'
p_cap.h:104: parse error before `*'
In file included from main.c:46:
gtk_pack.h:44: parse error before `GtkWidget'
gtk_pack.h:44: warning: no semicolon at end of struct or union
gtk_pack.h:45: warning: data definition has no type or storage class
gtk_pack.h:46: parse error before `*'
gtk_pack.h:46: warning: data definition has no type or storage class
gtk_pack.h:47: parse error before `*'
gtk_pack.h:47: warning: data definition has no type or storage class
gtk_pack.h:48: parse error before `*'
gtk_pack.h:48: warning: data definition has no type or storage class
gtk_pack.h:53: parse error before `*'
gtk_pack.h:53: warning: data definition has no type or storage class
gtk_pack.h:54: parse error before `*'
gtk_pack.h:54: warning: data definition has no type or storage class
gtk_pack.h:55: parse error before `*'
gtk_pack.h:55: warning: data definition has no type or storage class
gtk_pack.h:56: parse error before `*'
gtk_pack.h:56: warning: data definition has no type or storage class
gtk_pack.h:57: parse error before `*'
gtk_pack.h:57: warning: data definition has no type or storage class
gtk_pack.h:58: parse error before `*'
gtk_pack.h:58: warning: data definition has no type or storage class
gtk_pack.h:59: parse error before `*'
gtk_pack.h:59: warning: data definition has no type or storage class
gtk_pack.h:60: parse error before `*'
gtk_pack.h:60: warning: data definition has no type or storage class
gtk_pack.h:61: parse error before `*'
gtk_pack.h:61: warning: data definition has no type or storage class
gtk_pack.h:62: parse error before `*'
gtk_pack.h:62: warning: data definition has no type or storage class
gtk_pack.h:63: parse error before `*'
gtk_pack.h:63: warning: data definition has no type or storage class
gtk_pack.h:64: parse error before `*'
gtk_pack.h:64: warning: data definition has no type or storage class
gtk_pack.h:65: parse error before `}'
main.c: In function `main':
main.c:98: dereferencing pointer to incomplete type
main.c:101: dereferencing pointer to incomplete type
main.c:104: dereferencing pointer to incomplete type
main.c:113: dereferencing pointer to incomplete type
main.c:114: dereferencing pointer to incomplete type
main.c:124: dereferencing pointer to incomplete type
main.c:134: dereferencing pointer to incomplete type
main.c:137: dereferencing pointer to incomplete type
main.c:158: dereferencing pointer to incomplete type
main.c:168: dereferencing pointer to incomplete type
main.c:185: dereferencing pointer to incomplete type
main.c:195: dereferencing pointer to incomplete type
main.c:205: dereferencing pointer to incomplete type
main.c:218: dereferencing pointer to incomplete type
main.c:229: dereferencing pointer to incomplete type
main.c:229: dereferencing pointer to incomplete type
main.c:240: dereferencing pointer to incomplete type
main.c:248: dereferencing pointer to incomplete type
main.c:256: dereferencing pointer to incomplete type
main.c:264: dereferencing pointer to incomplete type
main.c:266: dereferencing pointer to incomplete type
main.c:266: dereferencing pointer to incomplete type
main.c:266: dereferencing pointer to incomplete type
main.c:275: dereferencing pointer to incomplete type
main.c:276: dereferencing pointer to incomplete type
main.c:285: dereferencing pointer to incomplete type
main.c: At top level:
p_cap.h:66: storage size of `errbuf' isn't known
make: *** [main.o] Error 1
 
  


Reply


Thread Tools Search this Thread
Search this Thread:

Advanced Search

Posting Rules
You may not post new threads
You may not post replies
You may not post attachments
You may not edit your posts

BB code is On
Smilies are On
[IMG] code is Off
HTML code is Off



Similar Threads
Thread Thread Starter Forum Replies Last Post
my time is wrong and calender is also wrong Paxmaster Linux - General 6 12-16-2004 12:46 AM
How to use GNU autoconf to generate a new configure from configure.in ?? vanhelsing Programming 5 08-05-2004 10:02 AM
configure: error: when trying to install / configure new software ? met tomfer007 Linux - Software 1 07-25-2004 03:52 PM
GRUB can't boot my new configure kernal. What's wrong? sabaka Linux - Newbie 1 11-23-2003 03:37 AM
are my ./configure arguments wrong? shanenin Linux - Software 1 10-19-2003 06:00 PM

LinuxQuestions.org > Forums > Linux Forums > Linux - Software

All times are GMT -5. The time now is 07:52 AM.

Main Menu
Advertisement
My LQ
Write for LQ
LinuxQuestions.org is looking for people interested in writing Editorials, Articles, Reviews, and more. If you'd like to contribute content, let us know.
Main Menu
Syndicate
RSS1  Latest Threads
RSS1  LQ News
Twitter: @linuxquestions
Facebook: linuxquestions Google+: linuxquestions
Open Source Consulting | Domain Registration