LinuxQuestions.org
Review your favorite Linux distribution.
Go Back   LinuxQuestions.org > Forums > Linux Forums > Linux - Software
User Name
Password
Linux - Software This forum is for Software issues.
Having a problem installing a new program? Want to know which application is best for the job? Post your question in this forum.

Notices

Reply
 
Search this Thread
Old 09-26-2004, 06:53 PM   #1
nboul
LQ Newbie
 
Registered: Sep 2004
Posts: 19

Rep: Reputation: 0
compile error with gcc 3.3.2 on Mandrake 10


Hi all,
I'm an trying since a plugin for XdTV, and still have the same error after the make.
I saw many threads about this kind of compiling problems with gcc, but in general the soft editors have patched their source code. It's not the case for me.
Any clue of sthg I could to ?

Thanks.

(off course I checked the source and there is no redefinition or whatever, I guess it's more a problem of compatibility between the compiler and the code.)

(Here is what I get after the make command

make all-recursive
make[1]: Entering directory `/home/nicolas/softs_dl/xawdecode-plugin-1.4.1'
Making all in src
make[2]: Entering directory `/home/nicolas/softs_dl/xawdecode-plugin-1.4.1/src'
source='fasouil.c' object='fasouil.lo' libtool=yes \
depfile='.deps/fasouil.Plo' tmpdepfile='.deps/fasouil.TPlo' \
depmode=gcc3 /bin/sh ../depcomp \
/bin/sh ../libtool-nofpic --mode=compile gcc -DHAVE_CONFIG_H -I. -I. -I.. -I/usr/local/include/xawdecode -Wall -D_REENTRANT -mcpu=i686 -O3 -fstrength-reduce -frerun-loop-opt -fexpensive-optimizations -fschedule-insns2 -fomit-frame-pointer -malign-double -fno-strict-aliasing -pipe -malign-loops=2 -malign-functions=2 -DCPU=686 -ffast-math -I/usr/X11R6/include -DPREFIX='"/usr/local"' -c -o fasouil.lo `test -f fasouil.c || echo './'`fasouil.c
rm -f .libs/fasouil.lo
gcc -DHAVE_CONFIG_H -I. -I. -I.. -I/usr/local/include/xawdecode -Wall -D_REENTRANT -mcpu=i686 -O3 -fstrength-reduce -frerun-loop-opt -fexpensive-optimizations -fschedule-insns2 -fomit-frame-pointer -malign-double -fno-strict-aliasing -pipe -malign-loops=2 -malign-functions=2 -DCPU=686 -ffast-math -I/usr/X11R6/include -DPREFIX=\"/usr/local\" -c fasouil.c -MT fasouil.lo -MD -MP -MF .deps/fasouil.TPlo -DPIC -o .libs/fasouil.lo
cc1: warning: -malign-loops is obsolete, use -falign-loops
cc1: warning: -malign-functions is obsolete, use -falign-functions
fasouil.c:70: warning: integer constant is too large for "long" type
fasouil.c:71: warning: integer constant is too large for "long" type
fasouil.c:72: warning: integer constant is too large for "long" type
fasouil.c:73: warning: integer constant is too large for "long" type
fasouil.c:74: warning: integer constant is too large for "long" type
fasouil.c:75: warning: integer constant is too large for "long" type
fasouil.c:76: warning: integer constant is too large for "long" type
fasouil.c:77: warning: integer constant is too large for "long" type
fasouil.c:78: warning: integer constant is too large for "long" type
fasouil.c:79: warning: integer constant is too large for "long" type
fasouil.c: In function `MoyenneAvecPrecedanteUnPeu':
fasouil.c:337: warning: integer constant is too large for "long" type
fasouil.c:338: warning: integer constant is too large for "long" type
fasouil.c: In function `SupprimeLigneViolet':
fasouil.c:440: warning: integer constant is too large for "long" type
fasouil.c:441: warning: integer constant is too large for "long" type
fasouil.c:442: warning: integer constant is too large for "long" type
fasouil.c: In function `FiltreUnKonnu_old':
fasouil.c:966: warning: integer constant is too large for "long" type
fasouil.c:967: warning: integer constant is too large for "long" type
fasouil.c:968: warning: integer constant is too large for "long" type
fasouil.c:969: warning: integer constant is too large for "long" type
fasouil.c: In function `VerifiPhaseFiltreUnKonnu':
fasouil.c:1286: warning: assignment from incompatible pointer type
fasouil.c:1289: warning: assignment from incompatible pointer type
fasouil.c:1308: warning: assignment from incompatible pointer type
fasouil.c:1311: warning: assignment from incompatible pointer type
fasouil.c:1258: warning: unused variable `phase0'
fasouil.c:1259: warning: unused variable `phase1'
fasouil.c: In function `DiminueVertATI':
fasouil.c:1537: warning: integer constant is too large for "long" type
fasouil.c:1538: warning: integer constant is too large for "long" type
fasouil.c: At top level:
fasouil.c:53: warning: `CompteurImageBandeNoire' defined but not used
fasouil.c:57: warning: `ValeurCorrelUnKonnu' defined but not used
fasouil.c:65: warning: `TailleVideoLigneOctet' defined but not used
fasouil.c:68: warning: `bConstructMemoryOK' defined but not used
{standard input}: Assembler messages:
{standard input}:1366: Error: symbol `MoyenneAvecPrecedanteUnPeu_AutrePixel' is already defined
{standard input}:1457: Error: symbol `FiltreUnKonnu_boucle' is already defined
{standard input}:1472: Error: symbol `FiltreUnKonnu_fincas' is already defined
{standard input}:1476: Error: symbol `FiltreUnKonnu_AutrePixel' is already defined
{standard input}:1633: Error: symbol `FiltreUnKonnu_old_AutrePixel' is already defined
{standard input}:1918: Error: symbol `DiminueVertATI_AutrePixel' is already defined
make[2]: *** [fasouil.lo] Erreur 1
make[2]: Leaving directory `/home/nicolas/softs_dl/xawdecode-plugin-1.4.1/src'
make[1]: *** [all-recursive] Erreur 1
make[1]: Leaving directory `/home/nicolas/softs_dl/xawdecode-plugin-1.4.1'
make: *** [all] Erreur 2
[nicolas@ip-166 xawdecode-plugin-1.4.1]$ make > log.txt
cc1: warning: -malign-loops is obsolete, use -falign-loops
cc1: warning: -malign-functions is obsolete, use -falign-functions
fasouil.c:70: warning: integer constant is too large for "long" type
fasouil.c:71: warning: integer constant is too large for "long" type
fasouil.c:72: warning: integer constant is too large for "long" type
fasouil.c:73: warning: integer constant is too large for "long" type
fasouil.c:74: warning: integer constant is too large for "long" type
fasouil.c:75: warning: integer constant is too large for "long" type
fasouil.c:76: warning: integer constant is too large for "long" type
fasouil.c:77: warning: integer constant is too large for "long" type
fasouil.c:78: warning: integer constant is too large for "long" type
fasouil.c:79: warning: integer constant is too large for "long" type
fasouil.c: In function `MoyenneAvecPrecedanteUnPeu':
fasouil.c:337: warning: integer constant is too large for "long" type
fasouil.c:338: warning: integer constant is too large for "long" type
fasouil.c: In function `SupprimeLigneViolet':
fasouil.c:440: warning: integer constant is too large for "long" type
fasouil.c:441: warning: integer constant is too large for "long" type
fasouil.c:442: warning: integer constant is too large for "long" type
fasouil.c: In function `FiltreUnKonnu_old':
fasouil.c:966: warning: integer constant is too large for "long" type
fasouil.c:967: warning: integer constant is too large for "long" type
fasouil.c:968: warning: integer constant is too large for "long" type
fasouil.c:969: warning: integer constant is too large for "long" type
fasouil.c: In function `VerifiPhaseFiltreUnKonnu':
fasouil.c:1286: warning: assignment from incompatible pointer type
fasouil.c:1289: warning: assignment from incompatible pointer type
fasouil.c:1308: warning: assignment from incompatible pointer type
fasouil.c:1311: warning: assignment from incompatible pointer type
fasouil.c:1258: warning: unused variable `phase0'
fasouil.c:1259: warning: unused variable `phase1'
fasouil.c: In function `DiminueVertATI':
fasouil.c:1537: warning: integer constant is too large for "long" type
fasouil.c:1538: warning: integer constant is too large for "long" type
fasouil.c: At top level:
fasouil.c:53: warning: `CompteurImageBandeNoire' defined but not used
fasouil.c:57: warning: `ValeurCorrelUnKonnu' defined but not used
fasouil.c:65: warning: `TailleVideoLigneOctet' defined but not used
fasouil.c:68: warning: `bConstructMemoryOK' defined but not used
{standard input}: Assembler messages:
{standard input}:1366: Error: symbol `MoyenneAvecPrecedanteUnPeu_AutrePixel' is already defined
{standard input}:1457: Error: symbol `FiltreUnKonnu_boucle' is already defined
{standard input}:1472: Error: symbol `FiltreUnKonnu_fincas' is already defined
{standard input}:1476: Error: symbol `FiltreUnKonnu_AutrePixel' is already defined
{standard input}:1633: Error: symbol `FiltreUnKonnu_old_AutrePixel' is already defined
{standard input}:1918: Error: symbol `DiminueVertATI_AutrePixel' is already defined
make[2]: *** [fasouil.lo] Erreur 1
make[1]: *** [all-recursive] Erreur 1
make: *** [all] Erreur 2

*** SOLVED ***

A patched version was published..

Last edited by nboul; 10-20-2004 at 03:53 PM.
 
  


Reply


Thread Tools Search this Thread
Search this Thread:

Advanced Search

Posting Rules
You may not post new threads
You may not post replies
You may not post attachments
You may not edit your posts

BB code is On
Smilies are On
[IMG] code is Off
HTML code is Off


Similar Threads
Thread Thread Starter Forum Replies Last Post
Strange GCC compile error with C code exvor Programming 16 08-23-2005 06:05 PM
compile GCC 4.0 error! ayiiq180 Linux - Software 3 04-22-2005 04:04 PM
Screen resolution and gcc 3.3 kernel compile error bugsbunny Debian 6 03-07-2005 01:51 PM
ndiswrapper compile error, mandrake 10 tack2sr Linux - Wireless Networking 1 02-27-2005 07:51 AM
gcc-2.3.2 compile error rimo Linux From Scratch 33 07-30-2003 07:55 AM


All times are GMT -5. The time now is 12:49 PM.

Main Menu
My LQ
Write for LQ
LinuxQuestions.org is looking for people interested in writing Editorials, Articles, Reviews, and more. If you'd like to contribute content, let us know.
Main Menu
Syndicate
RSS1  Latest Threads
RSS1  LQ News
Twitter: @linuxquestions
identi.ca: @linuxquestions
Facebook: linuxquestions Google+: linuxquestions
Open Source Consulting | Domain Registration