LinuxQuestions.org
Register a domain and help support LQ
Go Back   LinuxQuestions.org > Forums > Linux Forums > Linux - Software
User Name
Password
Linux - Software This forum is for Software issues.
Having a problem installing a new program? Want to know which application is best for the job? Post your question in this forum.

Notices


Reply
  Search this Thread
Old 09-26-2003, 08:04 AM   #1
Xing
Member
 
Registered: Aug 2003
Location: New Delhi, India
Distribution: RH 9, RH 8, RH 7.3,Slackware
Posts: 123

Rep: Reputation: 15
Angry BInutils 2.14 compilation problems


i m compiling binutils-2.14 and am getting this error when i m executing "make check".. before this i have installed gcc , glibc, tcltk, dejaGNU and expect .. this is for a distribution i m making for my use.. if anyone cud help, then please...

Regards
Xing

Running /mnt/binutils-2.14/binutils/testsuite/binutils-all/ar.exp ...
FAIL: ar long file names
ERROR: /mnt/binutils-2.14/binutils/testsuite/binutils-all/bintest.s: assembly failed
Running /mnt/binutils-2.14/binutils/testsuite/binutils-all/dlltool.exp ...
Running /mnt/binutils-2.14/binutils/testsuite/binutils-all/hppa/objdump.exp ...
Running /mnt/binutils-2.14/binutils/testsuite/binutils-all/nm.exp ...
Version /mnt/binutils-build/binutils/nm-new reference
ERROR: /mnt/binutils-2.14/binutils/testsuite/binutils-all/bintest.s: assembly failed
Running /mnt/binutils-2.14/binutils/testsuite/binutils-all/objcopy.exp ...
Version /mnt/binutils-build/binutils/objcopy reference
ERROR: /mnt/binutils-2.14/binutils/testsuite/binutils-all/bintest.s: assembly failed
ERROR: unresolved 1
Running /mnt/binutils-2.14/binutils/testsuite/binutils-all/objdump.exp ...
Version /mnt/binutils-build/binutils/objdump reference
FAIL: objdump -i
ERROR: /mnt/binutils-2.14/binutils/testsuite/binutils-all/bintest.s: assembly failed
Running /mnt/binutils-2.14/binutils/testsuite/binutils-all/readelf.exp ...
Version /mnt/binutils-build/binutils/readelf 20030612
ERROR: /mnt/binutils-2.14/binutils/testsuite/binutils-all/bintest.s: assembly failed
ERROR: unresolved 1
Running /mnt/binutils-2.14/binutils/testsuite/binutils-all/size.exp ...
Version /mnt/binutils-build/binutils/size reference
ERROR: /mnt/binutils-2.14/binutils/testsuite/binutils-all/bintest.s: assembly failed
Running /mnt/binutils-2.14/binutils/testsuite/binutils-all/windres/windres.exp ...

=== binutils Summary ===

# of unexpected failures 2
# of unresolved testcases 3
make[4]: *** [check-DEJAGNU] Error 1
make[4]: Leaving directory `/mnt/binutils-build/binutils'
make[3]: *** [check-am] Error 2
make[3]: Leaving directory `/mnt/binutils-build/binutils'
make[2]: *** [check-recursive] Error 1
make[2]: Leaving directory `/mnt/binutils-build/binutils'
make[1]: *** [check-binutils] Error 2
make[1]: Leaving directory `/mnt/binutils-build'
make: *** [check] Error 2
 
  


Reply


Thread Tools Search this Thread
Search this Thread:

Advanced Search

Posting Rules
You may not post new threads
You may not post replies
You may not post attachments
You may not edit your posts

BB code is On
Smilies are On
[IMG] code is Off
HTML code is Off



Similar Threads
Thread Thread Starter Forum Replies Last Post
C++ compilation problems madhatter301 Programming 4 03-16-2005 06:13 PM
Installation of binutils....can't mkdir...../binutils-build hmonster Linux From Scratch 6 08-22-2004 05:07 AM
Compilation Problems kamransoomro84 Programming 9 05-04-2004 07:39 PM
Kernel Compilation Problems jironimo Linux - Software 6 03-27-2004 09:58 AM
X compilation problems da Perp Linux From Scratch 2 07-16-2002 03:46 AM


All times are GMT -5. The time now is 04:32 PM.

Main Menu
Advertisement
My LQ
Write for LQ
LinuxQuestions.org is looking for people interested in writing Editorials, Articles, Reviews, and more. If you'd like to contribute content, let us know.
Main Menu
Syndicate
RSS1  Latest Threads
RSS1  LQ News
Twitter: @linuxquestions
Facebook: linuxquestions Google+: linuxquestions
Open Source Consulting | Domain Registration