LinuxQuestions.org
Welcome to the most active Linux Forum on the web.
Go Back   LinuxQuestions.org > Forums > Linux Forums > Linux - Software
User Name
Password
Linux - Software This forum is for Software issues.
Having a problem installing a new program? Want to know which application is best for the job? Post your question in this forum.

Notices

Reply
 
LinkBack Search this Thread
Old 05-23-2005, 03:32 PM   #1
megadeth
Member
 
Registered: Feb 2005
Distribution: Fedora Core 4 x64
Posts: 136

Rep: Reputation: 15
baghira build error


Quote:
[root@usual baghira-0.6e]# make
make all-recursive
make[1]: Entering directory `/root/baghira-0.6e'
Making all in bab
make[2]: Entering directory `/root/baghira-0.6e/bab'
make[2]: Nothing to be done for `all'.
make[2]: Leaving directory `/root/baghira-0.6e/bab'
Making all in colorscheme
make[2]: Entering directory `/root/baghira-0.6e/colorscheme'
make[2]: Nothing to be done for `all'.
make[2]: Leaving directory `/root/baghira-0.6e/colorscheme'
Making all in config
make[2]: Entering directory `/root/baghira-0.6e/config'
make[2]: Nothing to be done for `all'.
make[2]: Leaving directory `/root/baghira-0.6e/config'
Making all in deco
make[2]: Entering directory `/root/baghira-0.6e/deco'
Making all in config
make[3]: Entering directory `/root/baghira-0.6e/deco/config'
make[3]: Nothing to be done for `all'.
make[3]: Leaving directory `/root/baghira-0.6e/deco/config'
make[3]: Entering directory `/root/baghira-0.6e/deco'
if /bin/sh ../libtool --silent --mode=compile --tag=CXX g++ -DHAVE_CONFIG_H -I.-I. -I.. -I/usr/include/kde -I/usr/lib/qt-3.3/include -I/usr/X11R6/include -I/usr/include/kde/kwin -DQT_THREAD_SUPPORT -D_REENTRANT -Wnon-virtual-dtor -Wno-long-long -Wundef -ansi -D_XOPEN_SOURCE=500 -D_BSD_SOURCE -Wcast-align -Wconversion -Wchar-subscripts -Wall -W -Wpointer-arith -Wwrite-strings -DNDEBUG -DNO_DEBUG -O2 -Wformat-security -Wmissing-format-attribute -fno-exceptions -fno-check-new -fno-common -DQT_PLUGIN -MT baghiraclient.lo -MD -MP -MF ".deps/baghiraclient.Tpo" \
-c -o baghiraclient.lo `test -f 'baghiraclient.cc' || echo './'`baghiraclient.cc; \
then mv -f ".deps/baghiraclient.Tpo" ".deps/baghiraclient.Plo"; \
else rm -f ".deps/baghiraclient.Tpo"; exit 1; \
fi
baghiraclient.cc:56:1: warning: multi-line comment
baghiraclient.cc: In member function `QImage* Baghira::BaghiraFactory::tintGlossy(const QImage&, const QColor&) const':
baghiraclient.cc:652: warning: converting to `int' from `double'
baghiraclient.cc:654: warning: converting to `int' from `double'
In file included from baghiraclient.cc:2357:
baghiraclient.moc: At global scope:
baghiraclient.moc:23: error: invalid use of undefined type `struct Baghira::ResizeHandle'
baghiraclient.h:387: error: forward declaration of `struct Baghira::ResizeHandle'
baghiraclient.moc:27: error: invalid use of undefined type `struct Baghira::ResizeHandle'
baghiraclient.h:387: error: forward declaration of `struct Baghira::ResizeHandle'
baghiraclient.moc:28: error: incomplete type `Baghira::ResizeHandle' used in nested name specifier
baghiraclient.moc:32: error: invalid use of undefined type `struct Baghira::ResizeHandle'
baghiraclient.h:387: error: forward declaration of `struct Baghira::ResizeHandle'
baghiraclient.moc:40: error: invalid use of undefined type `struct Baghira::ResizeHandle'
baghiraclient.h:387: error: forward declaration of `struct Baghira::ResizeHandle'
baghiraclient.moc:51: error: invalid use of undefined type `struct Baghira::ResizeHandle'
baghiraclient.h:387: error: forward declaration of `struct Baghira::ResizeHandle'
baghiraclient.moc: In member function `QMetaObject* Baghira::ResizeHandle::staticMetaObject()':
baghiraclient.moc:52: error: `metaObj' undeclared (first use this function)
baghiraclient.moc:52: error: (Each undeclared identifier is reported only once for each function it appears in.)
baghiraclient.moc: At global scope:
baghiraclient.moc:69: error: invalid use of undefined type `struct Baghira::ResizeHandle'
baghiraclient.h:387: error: forward declaration of `struct Baghira::ResizeHandle'
baghiraclient.moc: In member function `void* Baghira::ResizeHandle::qt_cast(const char*)':
baghiraclient.moc:72: error: cannot call member function `virtual void* QWidget::qt_cast(const char*)' without object
baghiraclient.moc: At global scope:
baghiraclient.moc:76: error: invalid use of undefined type `struct Baghira::ResizeHandle'
baghiraclient.h:387: error: forward declaration of `struct Baghira::ResizeHandle'
baghiraclient.moc: In member function `bool Baghira::ResizeHandle::qt_invoke(int, QUObject*)':
baghiraclient.moc:77: error: cannot call member function `virtual bool QWidget::qt_invoke(int, QUObject*)' without object
baghiraclient.moc: At global scope:
baghiraclient.moc:81: error: invalid use of undefined type `struct Baghira::ResizeHandle'
baghiraclient.h:387: error: forward declaration of `struct Baghira::ResizeHandle'
baghiraclient.moc: In member function `bool Baghira::ResizeHandle::qt_emit(int,QUObject*)':
baghiraclient.moc:82: error: cannot call member function `virtual bool QWidget::qt_emit(int, QUObject*)' without object
baghiraclient.moc: At global scope:
baghiraclient.moc:87: error: invalid use of undefined type `struct Baghira::ResizeHandle'
baghiraclient.h:387: error: forward declaration of `struct Baghira::ResizeHandle'
baghiraclient.moc: In member function `bool Baghira::ResizeHandle::qt_property(int, int, QVariant*)':
baghiraclient.moc:88: error: cannot call member function `virtual bool QWidget::qt_property(int, int, QVariant*)' without object
baghiraclient.moc: At global scope:
baghiraclient.moc:91: error: invalid use of undefined type `struct Baghira::ResizeHandle'
baghiraclient.h:387: error: forward declaration of `struct Baghira::ResizeHandle'
make[3]: *** [baghiraclient.lo] Error 1
make[3]: Leaving directory `/root/baghira-0.6e/deco'
make[2]: *** [all-recursive] Error 1
make[2]: Leaving directory `/root/baghira-0.6e/deco'
make[1]: *** [all-recursive] Error 1
make[1]: Leaving directory `/root/baghira-0.6e'
make: *** [all] Error 2
[root@usual baghira-0.6e]#
What is wrong here? How can I fix it so that it does compile?
 
Old 05-23-2005, 05:30 PM   #2
halo14
Senior Member
 
Registered: Apr 2004
Location: Surprise, AZ
Distribution: Debian | CentOS | Arch
Posts: 1,103

Rep: Reputation: 45
did you do the './configure' first???

namely:
Code:
./configure --prefix=`kde-config --prefix` --disable-debug --enable-final
 
Old 05-23-2005, 06:47 PM   #3
megadeth
Member
 
Registered: Feb 2005
Distribution: Fedora Core 4 x64
Posts: 136

Original Poster
Rep: Reputation: 15
I did it w/o the extra options also. Same thing...
 
  


Reply


Thread Tools Search this Thread
Search this Thread:

Advanced Search

Posting Rules
You may not post new threads
You may not post replies
You may not post attachments
You may not edit your posts

BB code is On
Smilies are On
[IMG] code is Off
HTML code is Off
Trackbacks are Off
Pingbacks are On
Refbacks are Off


Similar Threads
Thread Thread Starter Forum Replies Last Post
Xorg build error FlashAsh99 Linux - Software 4 06-29-2005 03:46 AM
package build error help thushara Linux - General 1 03-31-2005 08:49 AM
Baghira shodekiagari Linux - Software 0 05-17-2004 09:24 PM
kernel build error CowboyJ Linux - Newbie 4 01-04-2004 10:13 PM
garnome build error Tarential Linux - Software 1 09-28-2003 03:25 AM


All times are GMT -5. The time now is 07:08 PM.

Main Menu
My LQ
Write for LQ
LinuxQuestions.org is looking for people interested in writing Editorials, Articles, Reviews, and more. If you'd like to contribute content, let us know.
Main Menu
Syndicate
RSS1  Latest Threads
RSS1  LQ News
Twitter: @linuxquestions
identi.ca: @linuxquestions
Facebook: linuxquestions Google+: linuxquestions
Open Source Consulting | Domain Registration