LinuxQuestions.org
Register a domain and help support LQ
Go Back   LinuxQuestions.org > Forums > Linux Forums > Linux - Software
User Name
Password
Linux - Software This forum is for Software issues.
Having a problem installing a new program? Want to know which application is best for the job? Post your question in this forum.

Notices


Reply
  Search this Thread
Old 11-12-2003, 12:46 PM   #1
redhatnoob
Member
 
Registered: Jun 2003
Location: NY
Distribution: Red Hat 9
Posts: 66

Rep: Reputation: 15
Angry Another Wine Compilation Error


Ok. So when I install the RPM for RedHat9, i get errors when I try to run halflife. I perfer the Direct X gameplay because it seems to rrespont to lag better for me so I downloaded the Wine-20031016 source tar file and extracted it.

When I run the ./tools/wineinstall it runs fine but when it prompts to install i get a list of errors at the end. Does anyone know the Error codes or what could be causing this. I know other people have had this problem.

stabs+ -Wpointer-arith -g -O2 -o directx.o directx.c
In file included from directx.c:34:
d3d8_private.h:-33750: internal error: Segmentation fault
Please submit a full bug report,
with preprocessed source if appropriate.
See <URL:http://bugzilla.redhat.com/bugzilla/> for instructions.
make[2]: *** [directx.o] Error 1
make[2]: Leaving directory `/home/bryan/wine-20031016/dlls/d3d8'
make[1]: *** [d3d8] Error 2
make[1]: Leaving directory `/home/bryan/wine-20031016/dlls'
make: *** [dlls] Error 2


Thanks in advance
 
Old 11-12-2003, 12:50 PM   #2
evil_Tak
Member
 
Registered: Oct 2003
Distribution: Debian/unstable
Posts: 85

Rep: Reputation: 15
Ouch!

The first thing to do is submit a bug report as the output suggested. What version of gcc is that?
 
Old 11-12-2003, 12:55 PM   #3
redhatnoob
Member
 
Registered: Jun 2003
Location: NY
Distribution: Red Hat 9
Posts: 66

Original Poster
Rep: Reputation: 15
How do I tell the version? I think its 2.3
 
  


Reply


Thread Tools Search this Thread
Search this Thread:

Advanced Search

Posting Rules
You may not post new threads
You may not post replies
You may not post attachments
You may not edit your posts

BB code is On
Smilies are On
[IMG] code is Off
HTML code is Off



Similar Threads
Thread Thread Starter Forum Replies Last Post
Kernel compilation error: Error 15: File not found Niceman2005 Linux - General 9 10-04-2007 04:45 AM
wine compilation problem anubis26 Linux - Software 2 01-25-2005 04:46 PM
Wine compilation eating my whole free space ivanatora Linux - General 5 08-03-2004 08:26 AM
problem with wine (compilation) Szczepek Linux - Software 1 07-12-2003 01:31 PM
Sqwebmail compilation error ... [maildirsearchC.o] Error 1 boogie_maan Linux - Software 0 10-26-2002 08:21 PM


All times are GMT -5. The time now is 01:17 PM.

Main Menu
Advertisement
My LQ
Write for LQ
LinuxQuestions.org is looking for people interested in writing Editorials, Articles, Reviews, and more. If you'd like to contribute content, let us know.
Main Menu
Syndicate
RSS1  Latest Threads
RSS1  LQ News
Twitter: @linuxquestions
Facebook: linuxquestions Google+: linuxquestions
Open Source Consulting | Domain Registration