LinuxQuestions.org
Review your favorite Linux distribution.
Go Back   LinuxQuestions.org > Forums > Linux Forums > Linux - Newbie
User Name
Password
Linux - Newbie This Linux forum is for members that are new to Linux.
Just starting out and have a question? If it is not in the man pages or the how-to's this is the place!

Notices


Reply
  Search this Thread
Old 05-04-2012, 08:15 AM   #1
abhilash2606
LQ Newbie
 
Registered: May 2012
Posts: 1

Rep: Reputation: Disabled
Unhappy XTest.h in xkbdbthid


am doing project using virtual keyboard... when i try to compile makefile i get this error


xkbd.c:26:34: error: X11/extensions/XTest.h: No such file or directory
xkbd.c: In function ‘main’:
xkbd.c:422: warning: format ‘%i’ expects type ‘int’, but argument 3 has type ‘Window’
make[1]: *** [xkbd.o] Error 1
make[1]: Leaving directory `/home/abhi/xkbdbthid-0.1/xkbd-0.8.15_bthid/src'
make: *** [all] Error 2




,even i installed many packages,but same problem persists
please tell me how to overcome this,, thanks in advance
 
Old 05-04-2012, 08:20 AM   #2
knudfl
LQ 5k Club
 
Registered: Jan 2008
Location: Copenhagen, DK
Distribution: pclos2016, Slack14.1 Deb Jessie, + 50+ other Linux OS, for test only.
Posts: 16,276

Rep: Reputation: 3156Reputation: 3156Reputation: 3156Reputation: 3156Reputation: 3156Reputation: 3156Reputation: 3156Reputation: 3156Reputation: 3156Reputation: 3156Reputation: 3156
Welcome to LQ.

Quote:
error: X11/extensions/XTest.h: No such file or directory
sudo apt-get install x11proto-xext-dev


You can use e.g. the online 'Search' to decide a package name for a missing file ..
http://packages.ubuntu.com/search?se...ions%2FXTest.h

.

Last edited by knudfl; 05-04-2012 at 08:21 AM.
 
  


Reply


Thread Tools Search this Thread
Search this Thread:

Advanced Search

Posting Rules
You may not post new threads
You may not post replies
You may not post attachments
You may not edit your posts

BB code is On
Smilies are On
[IMG] code is Off
HTML code is Off



Similar Threads
Thread Thread Starter Forum Replies Last Post
Configure: error: You must have the XTest library to build synergy cucolin@ Linux - Software 2 12-12-2009 10:17 AM
Xtest error compiling Synergy bpottle Linux - Software 1 12-12-2009 10:09 AM
XTEST extension not installed on this X server: Success rahul_x Linux - Software 1 07-05-2007 10:22 AM
XTEST extension not installed on this X server: Success rahul_x Linux - Newbie 1 07-05-2007 10:21 AM
XTEST extension not installed on this X server: Success rahul_x Linux - Server 0 07-05-2007 10:17 AM


All times are GMT -5. The time now is 10:55 PM.

Main Menu
Advertisement
My LQ
Write for LQ
LinuxQuestions.org is looking for people interested in writing Editorials, Articles, Reviews, and more. If you'd like to contribute content, let us know.
Main Menu
Syndicate
RSS1  Latest Threads
RSS1  LQ News
Twitter: @linuxquestions
Facebook: linuxquestions Google+: linuxquestions
Open Source Consulting | Domain Registration