LinuxQuestions.org
Latest LQ Deal: Complete CCNA, CCNP & Red Hat Certification Training Bundle
Go Back   LinuxQuestions.org > Forums > Linux Forums > Linux - Newbie
User Name
Password
Linux - Newbie This Linux forum is for members that are new to Linux.
Just starting out and have a question? If it is not in the man pages or the how-to's this is the place!

Notices


Reply
  Search this Thread
Old 03-22-2007, 12:56 PM   #1
uncle-c
Member
 
Registered: Oct 2006
Location: The Ether
Distribution: Fedora 14, Ubuntu , Slax 5.1.8, OpenSolaris, Centos 4.8
Posts: 296

Rep: Reputation: 30
xchm compilation error interpretation


Using SuSE ED 10.

Wanted to install xchm. Needed wxGTK. No probs, Downloaded the file and it installed smoothly. Installed version 2.8x

xchm required the chmlib libraries. No probs, installed chmlib.0.39. smoohtly.

The problem arose when I tried to compile xchm 0.98.

Code:
$ ./configure

checking for wx-config... /usr/local/bin/wx-configchecking for wxWindows version >= 2.4.0...  
Warning: No config found to match: /usr/local/bin/wx-config --static --libs in /usr/local/lib/wx/config  
If you require this configuration, please install the desired  library build.  
If this is part of an automated configuration  test and no other errors occur, you may safely ignore it.  
You may use wx-config --list to see all configs available in  the default prefix.yes (version 2.8.2)Warning: --rezflags, 
along with Mac OS classic resource building is deprecated.  You should remove this from your Makefile and build .app bundles instead.

---------------------------------
$ make

make  all-recursivemake[1]: Entering directory `/home/user/tmp/xchm-0.9.8'
Making all in m4make[2]: Entering directory `/home/user/tmp/xchm-0.9.8/m4'make[2]: Nothing to be done for `all'.make[2]: 
Leaving directory `/home/user/tmp/xchm-0.9.8/m4'Making all in pomake[2]: 
Entering directory `/home/user/tmp/xchm-0.9.8/po'make[2]: Nothing to be done for `all'.make[2]: 
Leaving directory `/home/user/tmp/xchm-0.9.8/po'Making all in srcmake[2]: 
Entering directory `/home/user/tmp/xchm-0.9.8/src'if g++ 
-DHAVE_CONFIG_H -I. -I. -I.. -I../art  -D_ENABLE_COPY_AND_FIND 
-I/usr/local/lib/wx/include/gtk2-ansi-release-2.8 
-I/usr/local/include/wx-2.8 -D_FILE_OFFSET_BITS=64 -D_LARGE_FILES -D__WXGTK__  -W -Wall -MT chmapp.o -MD -MP -MF ".deps/chmapp.Tpo" -c -o chmapp.o chmapp.cpp; 
\then mv -f ".deps/chmapp.Tpo" ".deps/chmapp.Po"; else rm -f ".deps/chmapp.Tpo"; 
exit 1; fi./chmframe.h:169: error: extra qualification ‘CHMFrame::’ on member ‘OnHistFile’
make[2]: *** [chmapp.o] Error 1make[2]: Leaving directory `/home/user/tmp/xchm-0.9.8/src'
make[1]: *** [all-recursive] Error 1make[1]: Leaving directory `/home/user/tmp/xchm-0.9.8'make: *** 
[all] Error2


---------------------------------------------

$ sudo  make install


make[1]: Leaving directory `/home/user/tmp/xchm-0.9.8/po'Making install in src
make[1]: Entering directory `/home/user/tmp/xchm-0.9.8/src'if g++ 
-DHAVE_CONFIG_H -I. -I. -I.. -I../art  -D_ENABLE_COPY_AND_FIND 
-I/usr/local/lib/wx/include/gtk2-ansi-release-2.8 -I/usr/local/include/wx-2.8 
-D_FILE_OFFSET_BITS=64 -D_LARGE_FILES -D__WXGTK__  -W -Wall -MT chmapp.o -MD -MP -MF ".deps/chmapp.Tpo" -c -o chmapp.o chmapp.cpp; 
\then mv -f ".deps/chmapp.Tpo" ".deps/chmapp.Po"; else rm -f ".deps/chmapp.Tpo"; 
exit 1; fi./chmframe.h:169: error: extra qualification ‘CHMFrame::’ on member ‘OnHistFile’
make[1]: *** [chmapp.o] Error 1make[1]: Leaving directory `/home/user/tmp/xchm-0.9.8/src'
make: *** [install-recursive] Error 1
I got similar error when trying to compile xchm version 1.2.
Has anyone using Suse 10 got it successfuly installed.
I'm having problems with the rpms as well.
Thanks for any pointers.

Uncle.
 
Old 03-22-2007, 03:44 PM   #2
uncle-c
Member
 
Registered: Oct 2006
Location: The Ether
Distribution: Fedora 14, Ubuntu , Slax 5.1.8, OpenSolaris, Centos 4.8
Posts: 296

Original Poster
Rep: Reputation: 30
I forced the rpm installation and it seemed to do the trick.
 
  


Reply


Thread Tools Search this Thread
Search this Thread:

Advanced Search

Posting Rules
You may not post new threads
You may not post replies
You may not post attachments
You may not edit your posts

BB code is On
Smilies are On
[IMG] code is Off
HTML code is Off



Similar Threads
Thread Thread Starter Forum Replies Last Post
Kernel compilation error: Error 15: File not found Niceman2005 Linux - General 9 10-04-2007 04:45 AM
xchm error NNP Linux - Software 1 08-25-2006 06:38 AM
c: output interpretation kpachopoulos Programming 3 08-17-2006 10:34 AM
Error message need interpretation Scallawag Linux - Software 3 02-03-2005 06:27 PM
tcpdump interpretation unixbrain Linux - Networking 7 04-28-2004 05:37 AM


All times are GMT -5. The time now is 03:07 AM.

Main Menu
Advertisement
My LQ
Write for LQ
LinuxQuestions.org is looking for people interested in writing Editorials, Articles, Reviews, and more. If you'd like to contribute content, let us know.
Main Menu
Syndicate
RSS1  Latest Threads
RSS1  LQ News
Twitter: @linuxquestions
Facebook: linuxquestions Google+: linuxquestions
Open Source Consulting | Domain Registration