LinuxQuestions.org
Help answer threads with 0 replies.
Go Back   LinuxQuestions.org > Forums > Linux Forums > Linux - Newbie
User Name
Password
Linux - Newbie This Linux forum is for members that are new to Linux.
Just starting out and have a question? If it is not in the man pages or the how-to's this is the place!

Notices


Reply
  Search this Thread
Old 10-23-2002, 12:10 AM   #1
grvtman
LQ Newbie
 
Registered: Oct 2002
Posts: 1

Rep: Reputation: 0
qt-3.0.5 make error


im useing mandrake 9.0 and tring to install qt-3.0.5 everything is good untill about 2 min into the make. i get an error and cant figure out what it is. i have tried quite a few times and still nothing. this is a clean install of mandrake. and here is the end of the log with the error in it

kernel/qwindowdefs.h:140: forward declaration of `union _XEvent'
kernel/qapplication_x11.cpp:5767: aggregate `XEvent otherEvent' has incomplete type and cannot be defined
kernel/qapplication_x11.cpp:5819: aggregate `XEvent xevent' has incomplete type and cannot be defined
kernel/qapplication_x11.cpp:5833: aggregate `XEvent xevent' has incomplete type and cannot be defined
{standard input}: Assembler messages:
{standard input}:329: Error: symbol `ncols' is already defined
{standard input}:350: Error: symbol `i' is already defined
make[2]: *** [.obj/release-shared-mt/qapplication_x11.o] Error 1
make[2]: Leaving directory `/usr/local/qt/src'
make[1]: *** [sub-src] Error 2
make[1]: Leaving directory `/usr/local/qt'
make: *** [init] Error 2
[root@172 qt]#

just cant figure out what the problem is i think everything is right but not sure
thanks for the help
grvtman
 
Old 10-23-2002, 01:58 AM   #2
unSpawn
Moderator
 
Registered: May 2001
Posts: 29,331
Blog Entries: 55

Rep: Reputation: 3530Reputation: 3530Reputation: 3530Reputation: 3530Reputation: 3530Reputation: 3530Reputation: 3530Reputation: 3530Reputation: 3530Reputation: 3530Reputation: 3530
If you got this from the tarball, try downloading the source rpm and either compile that, or rip it (for instance with Midnight Commander, mc) apart to look at the Makefile. If you compile the srpm and you got missing dependencies you'll be warned, which you'll be *not* when compiling from tarball.
 
  


Reply


Thread Tools Search this Thread
Search this Thread:

Advanced Search

Posting Rules
You may not post new threads
You may not post replies
You may not post attachments
You may not edit your posts

BB code is On
Smilies are On
[IMG] code is Off
HTML code is Off



Similar Threads
Thread Thread Starter Forum Replies Last Post
Really, really Weird trouble with make (make error 2) flyeater SUSE / openSUSE 5 06-20-2005 01:05 PM
xprobe2 "make" error make[1]: *** [config_set.o] Error 1 rsharma2000 Linux - Security 1 11-24-2004 05:10 PM
lopster v1.2.2 make error: No rule to make target `m4/glibc21.m4' Kropotkin Fedora 0 10-31-2004 12:19 PM
make failing to make with this error. Help needed? vdemuth Linux - Software 4 06-20-2004 04:08 PM
make: cc: command not found make: *** [gzip.o]error 127 zyjk Linux - Newbie 5 02-08-2002 10:58 AM


All times are GMT -5. The time now is 04:29 PM.

Main Menu
Advertisement
My LQ
Write for LQ
LinuxQuestions.org is looking for people interested in writing Editorials, Articles, Reviews, and more. If you'd like to contribute content, let us know.
Main Menu
Syndicate
RSS1  Latest Threads
RSS1  LQ News
Twitter: @linuxquestions
Facebook: linuxquestions Google+: linuxquestions
Open Source Consulting | Domain Registration