LinuxQuestions.org
Share your knowledge at the LQ Wiki.
Go Back   LinuxQuestions.org > Forums > Linux Forums > Linux - Newbie
User Name
Password
Linux - Newbie This Linux forum is for members that are new to Linux.
Just starting out and have a question? If it is not in the man pages or the how-to's this is the place!

Notices


Reply
  Search this Thread
Old 04-22-2008, 02:29 PM   #1
vikas027
Senior Member
 
Registered: May 2007
Location: Sydney
Distribution: RHEL, CentOS, Debian, OS X
Posts: 1,298

Rep: Reputation: 102Reputation: 102
Unhappy problems installing expect utilty


Hi all,


I am trying to install expect utility on RHEL 5. It is showing that we also need to install tcl also in order to run it.

I have downloaded expect from http://www.tucows.com/download.html?...load=automatic

and

tcl from http://prdownloads.sourceforge.net/t...5.2-src.tar.gz

Can someone please tell me steps how to install it as I am getting some errors while installing expect.

These are errors.

Code:
[root@RHEL expect-5.32]# make
gcc -c  -I. -I. -I/usr/local/src/tcl8.5.2/generic   -DEXP_VERSION=\"5.32.1\" -DSCRIPTDIR=\"/usr/local/lib/expect5.32\" -DEXECSCRIPTDIR=\"/usr/local/lib/expect5.32\" -DTCL_DEBUGGER  -DDFLT_STTY="\"sane\""  exp_main_exp.c
exp_main_exp.c: In function ‘main’:
exp_main_exp.c:26: warning: incompatible implicit declaration of built-in function ‘exit’
exp_main_exp.c:31: warning: incompatible implicit declaration of built-in function ‘exit’
if [ "xlibexpect5.32.a" != "xlibexpect5.32.a" ] ; then \
           if [ ! -d shared ] ; then \
                mkdir shared ; \
           else true; fi ; \
           gcc -c  -I. -I. -I/usr/local/src/tcl8.5.2/generic   -DEXP_VERSION=\"5.32.1\" -DSCRIPTDIR=\"/usr/local/lib/expect5.32\" -DEXECSCRIPTDIR=\"/usr/local/lib/expect5.32\" -DTCL_DEBUGGER   -DDFLT_STTY="\"sane\""  exp_main_exp.c -o shared/exp_main_exp.o ; \
        fi
gcc -c  -I. -I. -I/usr/local/src/tcl8.5.2/generic   -DEXP_VERSION=\"5.32.1\" -DSCRIPTDIR=\"/usr/local/lib/expect5.32\" -DEXECSCRIPTDIR=\"/usr/local/lib/expect5.32\" -DTCL_DEBUGGER  -DDFLT_STTY="\"sane\""  exp_command.c
In file included from /usr/local/src/tcl8.5.2/generic/tclInt.h:3836,
                 from exp_command.c:62:
/usr/local/src/tcl8.5.2/generic/tclPort.h:27:28: error: tclUnixPort.h: No such file or directory
In file included from /usr/local/src/tcl8.5.2/generic/tclInt.h:3838,
                 from exp_command.c:62:
/usr/local/src/tcl8.5.2/generic/tclIntPlatDecls.h:98: error: expected ‘=’, ‘,’, ‘;’, ‘asm’ or ‘__attribute__’ before ‘*’ token
/usr/local/src/tcl8.5.2/generic/tclIntPlatDecls.h:113: warning: ‘struct in_addr’ declared inside parameter list
/usr/local/src/tcl8.5.2/generic/tclIntPlatDecls.h:113: warning: its scope is only this definition or declaration, which is probably not what you want
/usr/local/src/tcl8.5.2/generic/tclIntPlatDecls.h:388: error: expected specifier-qualifier-list before ‘Tcl_DirEntry’
In file included from exp_command.c:72:
exp_command.h:111: error: expected specifier-qualifier-list before ‘WAIT_STATUS_TYPE’
exp_command.c: In function ‘expStateFromChannelName’:
exp_command.c:230: warning: assignment discards qualifiers from pointer target type
exp_command.c: In function ‘exp_wait_zero’:
exp_command.c:244: error: expected declaration specifiers before ‘WAIT_STATUS_TYPE’
exp_command.c:248: error: ‘WAIT_STATUS_TYPE’ undeclared (first use in this function)
exp_command.c:248: error: (Each undeclared identifier is reported only once
exp_command.c:248: error: for each function it appears in.)
exp_command.c: In function ‘exp_state_prep_for_invalidation’:
exp_command.c:263: error: ‘ExpState’ has no member named ‘fg_armed’
exp_command.c: In function ‘expBusy’:
exp_command.c:314: error: ‘ExpState’ has no member named ‘fdBusy’
exp_command.c: In function ‘exp_close’:
exp_command.c:335: error: ‘ExpState’ has no member named ‘leaveopen’
exp_command.c: In function ‘exp_init_spawn_ids’:
exp_command.c:452: error: ‘ExpState’ has no member named ‘keepForever’
exp_command.c:455: error: ‘ExpState’ has no member named ‘keepForever’
exp_command.c:459: error: ‘ExpState’ has no member named ‘keepForever’
exp_command.c: In function ‘Exp_SpawnCmd’:
exp_command.c:836: error: ‘ExpState’ has no member named ‘leaveopen’
exp_command.c:843: error: ‘ExpState’ has no member named ‘wait’
exp_command.c:925: warning: passing argument 1 of ‘expErrorLogU’ discards qualifiers from pointer target type
exp_command.c:1218: error: ‘ExpState’ has no member named ‘wait’
exp_command.c: In function ‘exp_i_parse_states’:
exp_command.c:1679: warning: passing argument 4 of ‘Tcl_SplitList’ from incompatible pointer type
exp_command.c:1690: warning: passing argument 1 of ‘expDiagLogU’ discards qualifiers from pointer target type
exp_command.c: In function ‘exp_i_update’:
exp_command.c:1703: warning: assignment discards qualifiers from pointer target type
exp_command.c: In function ‘Exp_SendObjCmd’:
exp_command.c:1824: warning: passing argument 3 of ‘Tcl_GetIndexFromObj’ from incompatible pointer type
exp_command.c: At top level:
exp_command.c:2438: error: expected specifier-qualifier-list before ‘WAIT_STATUS_TYPE’
exp_command.c: In function ‘fork_clear_all’:
exp_command.c:2448: error: ‘struct forked_proc’ has no member named ‘next’
exp_command.c:2449: error: ‘struct forked_proc’ has no member named ‘link_status’
exp_command.c:2449: error: ‘not_in_use’ undeclared (first use in this function)
exp_command.c: In function ‘fork_init’:
exp_command.c:2459: error: ‘struct forked_proc’ has no member named ‘link_status’
exp_command.c:2459: error: ‘wait_not_done’ undeclared (first use in this function)
exp_command.c: In function ‘fork_add’:
exp_command.c:2469: error: ‘struct forked_proc’ has no member named ‘next’
exp_command.c:2470: error: ‘struct forked_proc’ has no member named ‘link_status’
exp_command.c:2470: error: ‘not_in_use’ undeclared (first use in this function)
exp_command.c:2476: error: ‘struct forked_proc’ has no member named ‘next’
exp_command.c: In function ‘Exp_WaitCmd’:
exp_command.c:2550: error: ‘struct ExpState’ has no member named ‘wait’
exp_command.c:2558: error: ‘struct ExpState’ has no member named ‘wait’
exp_command.c:2589: error: ‘struct forked_proc’ has no member named ‘next’
exp_command.c:2590: error: ‘struct forked_proc’ has no member named ‘link_status’
exp_command.c:2590: error: ‘not_in_use’ undeclared (first use in this function)
exp_command.c:2592: error: ‘struct forked_proc’ has no member named ‘wait_status’
exp_command.c:2624: error: ‘struct ExpState’ has no member named ‘wait’
exp_command.c:2624: error: ‘struct forked_proc’ has no member named ‘wait_status’
exp_command.c:2638: error: ‘struct ExpState’ has no member named ‘wait’
exp_command.c:2638: error: ‘struct ExpState’ has no member named ‘wait’
exp_command.c:2639: error: ‘struct ExpState’ has no member named ‘wait’
exp_command.c:2639: error: ‘struct ExpState’ has no member named ‘wait’
exp_command.c:2641: error: ‘struct ExpState’ has no member named ‘wait’
exp_command.c:2641: error: ‘struct ExpState’ has no member named ‘wait’
exp_command.c:2642: error: ‘struct ExpState’ has no member named ‘wait’
exp_command.c:2642: error: ‘struct ExpState’ has no member named ‘wait’
exp_command.c:2643: error: ‘struct ExpState’ has no member named ‘wait’
exp_command.c:2643: error: ‘struct ExpState’ has no member named ‘wait’
exp_command.c:2645: error: ‘struct ExpState’ has no member named ‘wait’
exp_command.c:2645: error: ‘struct ExpState’ has no member named ‘wait’
exp_command.c:2646: error: ‘struct ExpState’ has no member named ‘wait’
exp_command.c:2646: error: ‘struct ExpState’ has no member named ‘wait’
exp_command.c:2651: error: ‘struct forked_proc’ has no member named ‘link_status’
exp_command.c: In function ‘Exp_DisconnectCmd’:
exp_command.c:2748: error: ‘ExpState’ has no member named ‘valid’
exp_command.c:2763: error: ‘ExpState’ has no member named ‘valid’
exp_command.c: In function ‘Exp_InterpreterObjCmd’:
exp_command.c:2882: warning: passing argument 3 of ‘Tcl_GetIndexFromObj’ from incompatible pointer type
make: *** [exp_command.o] Error 1
[root@RHEL expect-5.32]# make install
gcc -c  -I. -I. -I/usr/local/src/tcl8.5.2/generic   -DEXP_VERSION=\"5.32.1\" -DSCRIPTDIR=\"/usr/local/lib/expect5.32\" -DEXECSCRIPTDIR=\"/usr/local/lib/expect5.32\" -DTCL_DEBUGGER  -DDFLT_STTY="\"sane\""  exp_command.c
In file included from /usr/local/src/tcl8.5.2/generic/tclInt.h:3836,
                 from exp_command.c:62:
/usr/local/src/tcl8.5.2/generic/tclPort.h:27:28: error: tclUnixPort.h: No such file or directory
In file included from /usr/local/src/tcl8.5.2/generic/tclInt.h:3838,
                 from exp_command.c:62:
/usr/local/src/tcl8.5.2/generic/tclIntPlatDecls.h:98: error: expected ‘=’, ‘,’, ‘;’, ‘asm’ or ‘__attribute__’ before ‘*’ token
/usr/local/src/tcl8.5.2/generic/tclIntPlatDecls.h:113: warning: ‘struct in_addr’ declared inside parameter list
/usr/local/src/tcl8.5.2/generic/tclIntPlatDecls.h:113: warning: its scope is only this definition or declaration, which is probably not what you want
/usr/local/src/tcl8.5.2/generic/tclIntPlatDecls.h:388: error: expected specifier-qualifier-list before ‘Tcl_DirEntry’
In file included from exp_command.c:72:
exp_command.h:111: error: expected specifier-qualifier-list before ‘WAIT_STATUS_TYPE’
exp_command.c: In function ‘expStateFromChannelName’:
exp_command.c:230: warning: assignment discards qualifiers from pointer target type
exp_command.c: In function ‘exp_wait_zero’:
exp_command.c:244: error: expected declaration specifiers before ‘WAIT_STATUS_TYPE’
exp_command.c:248: error: ‘WAIT_STATUS_TYPE’ undeclared (first use in this function)
exp_command.c:248: error: (Each undeclared identifier is reported only once
exp_command.c:248: error: for each function it appears in.)
exp_command.c: In function ‘exp_state_prep_for_invalidation’:
exp_command.c:263: error: ‘ExpState’ has no member named ‘fg_armed’
exp_command.c: In function ‘expBusy’:
exp_command.c:314: error: ‘ExpState’ has no member named ‘fdBusy’
exp_command.c: In function ‘exp_close’:
exp_command.c:335: error: ‘ExpState’ has no member named ‘leaveopen’
exp_command.c: In function ‘exp_init_spawn_ids’:
exp_command.c:452: error: ‘ExpState’ has no member named ‘keepForever’
exp_command.c:455: error: ‘ExpState’ has no member named ‘keepForever’
exp_command.c:459: error: ‘ExpState’ has no member named ‘keepForever’
exp_command.c: In function ‘Exp_SpawnCmd’:
exp_command.c:836: error: ‘ExpState’ has no member named ‘leaveopen’
exp_command.c:843: error: ‘ExpState’ has no member named ‘wait’
exp_command.c:925: warning: passing argument 1 of ‘expErrorLogU’ discards qualifiers from pointer target type
exp_command.c:1218: error: ‘ExpState’ has no member named ‘wait’
exp_command.c: In function ‘exp_i_parse_states’:
exp_command.c:1679: warning: passing argument 4 of ‘Tcl_SplitList’ from incompatible pointer type
exp_command.c:1690: warning: passing argument 1 of ‘expDiagLogU’ discards qualifiers from pointer target type
exp_command.c: In function ‘exp_i_update’:
exp_command.c:1703: warning: assignment discards qualifiers from pointer target type
exp_command.c: In function ‘Exp_SendObjCmd’:
exp_command.c:1824: warning: passing argument 3 of ‘Tcl_GetIndexFromObj’ from incompatible pointer type
exp_command.c: At top level:
exp_command.c:2438: error: expected specifier-qualifier-list before ‘WAIT_STATUS_TYPE’
exp_command.c: In function ‘fork_clear_all’:
exp_command.c:2448: error: ‘struct forked_proc’ has no member named ‘next’
exp_command.c:2449: error: ‘struct forked_proc’ has no member named ‘link_status’
exp_command.c:2449: error: ‘not_in_use’ undeclared (first use in this function)
exp_command.c: In function ‘fork_init’:
exp_command.c:2459: error: ‘struct forked_proc’ has no member named ‘link_status’
exp_command.c:2459: error: ‘wait_not_done’ undeclared (first use in this function)
exp_command.c: In function ‘fork_add’:
exp_command.c:2469: error: ‘struct forked_proc’ has no member named ‘next’
exp_command.c:2470: error: ‘struct forked_proc’ has no member named ‘link_status’
exp_command.c:2470: error: ‘not_in_use’ undeclared (first use in this function)
exp_command.c:2476: error: ‘struct forked_proc’ has no member named ‘next’
exp_command.c: In function ‘Exp_WaitCmd’:
exp_command.c:2550: error: ‘struct ExpState’ has no member named ‘wait’
exp_command.c:2558: error: ‘struct ExpState’ has no member named ‘wait’
exp_command.c:2589: error: ‘struct forked_proc’ has no member named ‘next’
exp_command.c:2590: error: ‘struct forked_proc’ has no member named ‘link_status’
exp_command.c:2590: error: ‘not_in_use’ undeclared (first use in this function)
exp_command.c:2592: error: ‘struct forked_proc’ has no member named ‘wait_status’
exp_command.c:2624: error: ‘struct ExpState’ has no member named ‘wait’
exp_command.c:2624: error: ‘struct forked_proc’ has no member named ‘wait_status’
exp_command.c:2638: error: ‘struct ExpState’ has no member named ‘wait’
exp_command.c:2638: error: ‘struct ExpState’ has no member named ‘wait’
exp_command.c:2639: error: ‘struct ExpState’ has no member named ‘wait’
exp_command.c:2639: error: ‘struct ExpState’ has no member named ‘wait’
exp_command.c:2641: error: ‘struct ExpState’ has no member named ‘wait’
exp_command.c:2641: error: ‘struct ExpState’ has no member named ‘wait’
exp_command.c:2642: error: ‘struct ExpState’ has no member named ‘wait’
exp_command.c:2642: error: ‘struct ExpState’ has no member named ‘wait’
exp_command.c:2643: error: ‘struct ExpState’ has no member named ‘wait’
exp_command.c:2643: error: ‘struct ExpState’ has no member named ‘wait’
exp_command.c:2645: error: ‘struct ExpState’ has no member named ‘wait’
exp_command.c:2645: error: ‘struct ExpState’ has no member named ‘wait’
exp_command.c:2646: error: ‘struct ExpState’ has no member named ‘wait’
exp_command.c:2646: error: ‘struct ExpState’ has no member named ‘wait’
exp_command.c:2651: error: ‘struct forked_proc’ has no member named ‘link_status’
exp_command.c: In function ‘Exp_DisconnectCmd’:
exp_command.c:2748: error: ‘ExpState’ has no member named ‘valid’
exp_command.c:2763: error: ‘ExpState’ has no member named ‘valid’
exp_command.c: In function ‘Exp_InterpreterObjCmd’:
exp_command.c:2882: warning: passing argument 3 of ‘Tcl_GetIndexFromObj’ from incompatible pointer type
make: *** [exp_command.o] Error 1
[root@RHEL expect-5.32]# make
gcc -c  -I. -I. -I/usr/local/src/tcl8.5.2/generic   -DEXP_VERSION=\"5.32.1\" -DSCRIPTDIR=\"/usr/local/lib/expect5.32\" -DEXECSCRIPTDIR=\"/usr/local/lib/expect5.32\" -DTCL_DEBUGGER  -DDFLT_STTY="\"sane\""  exp_command.c
In file included from /usr/local/src/tcl8.5.2/generic/tclInt.h:3836,
                 from exp_command.c:62:
/usr/local/src/tcl8.5.2/generic/tclPort.h:27:28: error: tclUnixPort.h: No such file or directory
In file included from /usr/local/src/tcl8.5.2/generic/tclInt.h:3838,
                 from exp_command.c:62:
/usr/local/src/tcl8.5.2/generic/tclIntPlatDecls.h:98: error: expected ‘=’, ‘,’, ‘;’, ‘asm’ or ‘__attribute__’ before ‘*’ token
/usr/local/src/tcl8.5.2/generic/tclIntPlatDecls.h:113: warning: ‘struct in_addr’ declared inside parameter list
/usr/local/src/tcl8.5.2/generic/tclIntPlatDecls.h:113: warning: its scope is only this definition or declaration, which is probably not what you want
/usr/local/src/tcl8.5.2/generic/tclIntPlatDecls.h:388: error: expected specifier-qualifier-list before ‘Tcl_DirEntry’
In file included from exp_command.c:72:
exp_command.h:111: error: expected specifier-qualifier-list before ‘WAIT_STATUS_TYPE’
exp_command.c: In function ‘expStateFromChannelName’:
exp_command.c:230: warning: assignment discards qualifiers from pointer target type
exp_command.c: In function ‘exp_wait_zero’:
exp_command.c:244: error: expected declaration specifiers before ‘WAIT_STATUS_TYPE’
exp_command.c:248: error: ‘WAIT_STATUS_TYPE’ undeclared (first use in this function)
exp_command.c:248: error: (Each undeclared identifier is reported only once
exp_command.c:248: error: for each function it appears in.)
exp_command.c: In function ‘exp_state_prep_for_invalidation’:
exp_command.c:263: error: ‘ExpState’ has no member named ‘fg_armed’
exp_command.c: In function ‘expBusy’:
exp_command.c:314: error: ‘ExpState’ has no member named ‘fdBusy’
exp_command.c: In function ‘exp_close’:
exp_command.c:335: error: ‘ExpState’ has no member named ‘leaveopen’
exp_command.c: In function ‘exp_init_spawn_ids’:
exp_command.c:452: error: ‘ExpState’ has no member named ‘keepForever’
exp_command.c:455: error: ‘ExpState’ has no member named ‘keepForever’
exp_command.c:459: error: ‘ExpState’ has no member named ‘keepForever’
exp_command.c: In function ‘Exp_SpawnCmd’:
exp_command.c:836: error: ‘ExpState’ has no member named ‘leaveopen’
exp_command.c:843: error: ‘ExpState’ has no member named ‘wait’
exp_command.c:925: warning: passing argument 1 of ‘expErrorLogU’ discards qualifiers from pointer target type
exp_command.c:1218: error: ‘ExpState’ has no member named ‘wait’
exp_command.c: In function ‘exp_i_parse_states’:
exp_command.c:1679: warning: passing argument 4 of ‘Tcl_SplitList’ from incompatible pointer type
exp_command.c:1690: warning: passing argument 1 of ‘expDiagLogU’ discards qualifiers from pointer target type
exp_command.c: In function ‘exp_i_update’:
exp_command.c:1703: warning: assignment discards qualifiers from pointer target type
exp_command.c: In function ‘Exp_SendObjCmd’:
exp_command.c:1824: warning: passing argument 3 of ‘Tcl_GetIndexFromObj’ from incompatible pointer type
exp_command.c: At top level:
exp_command.c:2438: error: expected specifier-qualifier-list before ‘WAIT_STATUS_TYPE’
exp_command.c: In function ‘fork_clear_all’:
exp_command.c:2448: error: ‘struct forked_proc’ has no member named ‘next’
exp_command.c:2449: error: ‘struct forked_proc’ has no member named ‘link_status’
exp_command.c:2449: error: ‘not_in_use’ undeclared (first use in this function)
exp_command.c: In function ‘fork_init’:
exp_command.c:2459: error: ‘struct forked_proc’ has no member named ‘link_status’
exp_command.c:2459: error: ‘wait_not_done’ undeclared (first use in this function)
exp_command.c: In function ‘fork_add’:
exp_command.c:2469: error: ‘struct forked_proc’ has no member named ‘next’
exp_command.c:2470: error: ‘struct forked_proc’ has no member named ‘link_status’
exp_command.c:2470: error: ‘not_in_use’ undeclared (first use in this function)
exp_command.c:2476: error: ‘struct forked_proc’ has no member named ‘next’
exp_command.c: In function ‘Exp_WaitCmd’:
exp_command.c:2550: error: ‘struct ExpState’ has no member named ‘wait’
exp_command.c:2558: error: ‘struct ExpState’ has no member named ‘wait’
exp_command.c:2589: error: ‘struct forked_proc’ has no member named ‘next’
exp_command.c:2590: error: ‘struct forked_proc’ has no member named ‘link_status’
exp_command.c:2590: error: ‘not_in_use’ undeclared (first use in this function)
exp_command.c:2592: error: ‘struct forked_proc’ has no member named ‘wait_status’
exp_command.c:2624: error: ‘struct ExpState’ has no member named ‘wait’
exp_command.c:2624: error: ‘struct forked_proc’ has no member named ‘wait_status’
exp_command.c:2638: error: ‘struct ExpState’ has no member named ‘wait’
exp_command.c:2638: error: ‘struct ExpState’ has no member named ‘wait’
exp_command.c:2639: error: ‘struct ExpState’ has no member named ‘wait’
exp_command.c:2639: error: ‘struct ExpState’ has no member named ‘wait’
exp_command.c:2641: error: ‘struct ExpState’ has no member named ‘wait’
exp_command.c:2641: error: ‘struct ExpState’ has no member named ‘wait’
exp_command.c:2642: error: ‘struct ExpState’ has no member named ‘wait’
exp_command.c:2642: error: ‘struct ExpState’ has no member named ‘wait’
exp_command.c:2643: error: ‘struct ExpState’ has no member named ‘wait’
exp_command.c:2643: error: ‘struct ExpState’ has no member named ‘wait’
exp_command.c:2645: error: ‘struct ExpState’ has no member named ‘wait’
exp_command.c:2645: error: ‘struct ExpState’ has no member named ‘wait’
exp_command.c:2646: error: ‘struct ExpState’ has no member named ‘wait’
exp_command.c:2646: error: ‘struct ExpState’ has no member named ‘wait’
exp_command.c:2651: error: ‘struct forked_proc’ has no member named ‘link_status’
exp_command.c: In function ‘Exp_DisconnectCmd’:
exp_command.c:2748: error: ‘ExpState’ has no member named ‘valid’
exp_command.c:2763: error: ‘ExpState’ has no member named ‘valid’
exp_command.c: In function ‘Exp_InterpreterObjCmd’:
exp_command.c:2882: warning: passing argument 3 of ‘Tcl_GetIndexFromObj’ from incompatible pointer type
make: *** [exp_command.o] Error 1
[root@RHEL expect-5.32]#


Please tell me of there is any other way of installing it.


Thanks,
Vikas
 
Old 04-22-2008, 02:44 PM   #2
acid_kewpie
Moderator
 
Registered: Jun 2001
Location: UK
Distribution: Gentoo, RHEL, Fedora, Centos
Posts: 43,417

Rep: Reputation: 1974Reputation: 1974Reputation: 1974Reputation: 1974Reputation: 1974Reputation: 1974Reputation: 1974Reputation: 1974Reputation: 1974Reputation: 1974Reputation: 1974
afaik expect is already installed by default. if not it is on your distro dvd an available via yum. don't build it yourself.

unrelated to programming. moved to linux - newbie.
 
  


Reply


Thread Tools Search this Thread
Search this Thread:

Advanced Search

Posting Rules
You may not post new threads
You may not post replies
You may not post attachments
You may not edit your posts

BB code is On
Smilies are On
[IMG] code is Off
HTML code is Off



Similar Threads
Thread Thread Starter Forum Replies Last Post
New CPU and MB: Should I expect problems with my old HD? frankie_DJ Linux - Hardware 6 04-23-2006 12:34 PM
Installing Expect kartheekpn Linux - Software 2 12-28-2005 04:06 PM
network utilty? mchitrakar Linux - Networking 4 04-22-2004 10:25 AM
problems with scripting in expect wedgeworth Linux - Software 1 10-07-2003 04:34 PM
still problems with expect wedgeworth Linux - Software 2 09-15-2003 03:06 PM


All times are GMT -5. The time now is 08:05 PM.

Main Menu
Advertisement
My LQ
Write for LQ
LinuxQuestions.org is looking for people interested in writing Editorials, Articles, Reviews, and more. If you'd like to contribute content, let us know.
Main Menu
Syndicate
RSS1  Latest Threads
RSS1  LQ News
Twitter: @linuxquestions
Facebook: linuxquestions Google+: linuxquestions
Open Source Consulting | Domain Registration