LinuxQuestions.org
Support LQ: Use code LQ3 and save $3 on Domain Registration
Go Back   LinuxQuestions.org > Forums > Linux Forums > Linux - Newbie
User Name
Password
Linux - Newbie This Linux forum is for members that are new to Linux.
Just starting out and have a question? If it is not in the man pages or the how-to's this is the place!

Notices


Reply
  Search this Thread
Old 01-12-2008, 03:24 PM   #16
MrLinuxBoy
LQ Newbie
 
Registered: Jan 2008
Posts: 13

Original Poster
Rep: Reputation: 0

So how do i fix this and how do i increase the verbosity?
 
Old 01-12-2008, 03:36 PM   #17
Uncle_Theodore
Member
 
Registered: Dec 2007
Location: Charleston WV, USA
Distribution: Slackware 12.2, Arch Linux Amd64
Posts: 896

Rep: Reputation: 60
The short answer is no way. If there's a source bug you just send a bug report to the maintainer/author of the package and patiently wait for a resolution.
Formally, if ./configure reports no problem, but make fails, it IS a maintainer's problem. It should not happen.
 
Old 01-12-2008, 03:43 PM   #18
MrLinuxBoy
LQ Newbie
 
Registered: Jan 2008
Posts: 13

Original Poster
Rep: Reputation: 0
Talking

OK, well thanks to all you guys who helped me in this problem and this just shows how great the Linux community is, long live LINUX...
 
Old 01-12-2008, 03:53 PM   #19
Emerson
LQ Guru
 
Registered: Nov 2004
Location: Saint Amant, Acadiana
Distribution: Gentoo ~arch
Posts: 5,872

Rep: Reputation: Disabled
Installing MLT may help.
 
Old 01-12-2008, 04:24 PM   #20
Emerson
LQ Guru
 
Registered: Nov 2004
Location: Saint Amant, Acadiana
Distribution: Gentoo ~arch
Posts: 5,872

Rep: Reputation: Disabled
Yep. My wife's PC is running KDE, so I ssh-d to it and tried to build kdenlive-0.5.1.
First, configure complained mlt-config is missing but still finished with success message.
Compile fails.
Installed MLT.
Configure gives no errors.
Compile stops, complaining cannot find mlt++.h.
Installed mlt++.
It builds fine.

As Uncle_Theodore said, it's not ready for production use.
 
Old 01-12-2008, 05:18 PM   #21
MrLinuxBoy
LQ Newbie
 
Registered: Jan 2008
Posts: 13

Original Poster
Rep: Reputation: 0
Thats great but where on earth did you get MLT? i have been looking but cannot find it unless its under a different name.
 
Old 01-12-2008, 05:24 PM   #22
MrLinuxBoy
LQ Newbie
 
Registered: Jan 2008
Posts: 13

Original Poster
Rep: Reputation: 0
Ah i believe its under the name 'libmlt' so i installed libmlt-dev and libmlt++ but now i get the following.

/home/mrlinux/Download/kdenlive-0.5/kdenlive/krender.cpp:446: error: ‘AVFormatContext’ was not declared in this scope
/home/mrlinux/Download/kdenlive-0.5/kdenlive/krender.cpp:446: error: ‘context’ was not declared in this scope
/home/mrlinux/Download/kdenlive-0.5/kdenlive/krender.cpp:446: error: expected primary-expression before ‘)’ token
/home/mrlinux/Download/kdenlive-0.5/kdenlive/krender.cpp:446: error: expected `;' before ‘mlt_properties_get_data’
/home/mrlinux/Download/kdenlive-0.5/kdenlive/krender.cpp:452: error: expected primary-expression before ‘)’ token
/home/mrlinux/Download/kdenlive-0.5/kdenlive/krender.cpp:452: error: expected `;' before ‘mlt_properties_get_data’

Now i am using gnome not KDE but shouldn't make a difference...
 
Old 01-12-2008, 05:36 PM   #23
Emerson
LQ Guru
 
Registered: Nov 2004
Location: Saint Amant, Acadiana
Distribution: Gentoo ~arch
Posts: 5,872

Rep: Reputation: Disabled
Run 'unsermake clean' and ./configure again and look carefully at output. Something else is missing in your box. (I couldn't build it in my box, I have no QT.)
 
  


Reply


Thread Tools Search this Thread
Search this Thread:

Advanced Search

Posting Rules
You may not post new threads
You may not post replies
You may not post attachments
You may not edit your posts

BB code is On
Smilies are On
[IMG] code is Off
HTML code is Off



Similar Threads
Thread Thread Starter Forum Replies Last Post
glibc-2.3.4 make check error Snowmiss Linux From Scratch 1 08-04-2006 05:44 AM
binutils make check error suzuki_babu Linux - Software 0 05-02-2006 02:47 AM
Error:6.11 Glibc-2.3.4---make check ukyo Linux From Scratch 3 08-26-2005 06:33 PM
Automake: make check error _InTeNsDoWn_ Linux From Scratch 1 08-08-2005 01:56 AM
gcc-3.3.1 make -k check - make [check] Error 2 BarryM45 Linux From Scratch 1 02-05-2004 09:44 AM


All times are GMT -5. The time now is 04:55 PM.

Main Menu
Advertisement
My LQ
Write for LQ
LinuxQuestions.org is looking for people interested in writing Editorials, Articles, Reviews, and more. If you'd like to contribute content, let us know.
Main Menu
Syndicate
RSS1  Latest Threads
RSS1  LQ News
Twitter: @linuxquestions
Facebook: linuxquestions Google+: linuxquestions
Open Source Consulting | Domain Registration