LinuxQuestions.org
Download your favorite Linux distribution at LQ ISO.
Go Back   LinuxQuestions.org > Forums > Linux Forums > Linux - Newbie
User Name
Password
Linux - Newbie This Linux forum is for members that are new to Linux.
Just starting out and have a question? If it is not in the man pages or the how-to's this is the place!

Notices


Reply
  Search this Thread
Old 06-03-2004, 02:52 PM   #1
Xoom
LQ Newbie
 
Registered: Nov 2003
Posts: 13

Rep: Reputation: 0
installing orinoco_cs driver (make error)


When installing the orinoco_cs driver (.13e) I get the following error. I just emerged (gentoo) the latest version of pcmcia-cs.

root@x1000 root # ls
Desktop hermes.c hermes_rid.h orinoco.c orinoco_pci.c
Makefile hermes.conf ieee802_11.h orinoco.h orinoco_plx.c
README.orinoco hermes.h orinoco-0.13e orinoco.o orinoco_tmd.c
airport.c hermes.o orinoco-0.13e.tar.gz orinoco_cs.c userhermes.c
root@x1000 root # make
make -C /lib/modules/2.6.5-gentoo-r1/build SUBDIRS=/root modules
make[1]: Entering directory `/usr/src/linux-2.6.5-gentoo-r1'
*** Warning: Overriding SUBDIRS on the command line can cause
*** inconsistencies
make[2]: `arch/i386/kernel/asm-offsets.s' is up to date.
CC [M] /root/orinoco_cs.o
/root/orinoco_cs.c: In function `orinoco_cs_hard_reset':
/root/orinoco_cs.c:134: warning: implicit declaration of function `CardServices'
/root/orinoco_cs.c: In function `orinoco_cs_attach':
/root/orinoco_cs.c:206: error: structure has no member named `release'
/root/orinoco_cs.c:207: error: structure has no member named `release'
/root/orinoco_cs.c:208: error: structure has no member named `release'
/root/orinoco_cs.c: In function `init_orinoco_cs':
/root/orinoco_cs.c:688: warning: implicit declaration of function `register_pcca rd_driver'
/root/orinoco_cs.c: In function `exit_orinoco_cs':
/root/orinoco_cs.c:696: warning: implicit declaration of function `unregister_pc card_driver'
make[2]: *** [/root/orinoco_cs.o] Error 1
make[1]: *** [/root] Error 2
make[1]: Leaving directory `/usr/src/linux-2.6.5-gentoo-r1'
make: *** [modules] Error 2
 
Old 06-04-2004, 07:11 AM   #2
Xoom
LQ Newbie
 
Registered: Nov 2003
Posts: 13

Original Poster
Rep: Reputation: 0
anyone?
 
Old 06-09-2004, 01:21 AM   #3
Sammy2ooo
Member
 
Registered: Jan 2003
Location: nearby switzerland
Distribution: Suse 8.0 / Suse 9.0 / Slackware 9.1 / Debian Sarge testing / Gentoo 1.4.10
Posts: 165

Rep: Reputation: 30
it seems that u r using kernel version 2.6. I have got the same problem, that my orinoco monitor_enabled patched 13e drivers doesnt compile under 2.6 ((
 
  


Reply


Thread Tools Search this Thread
Search this Thread:

Advanced Search

Posting Rules
You may not post new threads
You may not post replies
You may not post attachments
You may not edit your posts

BB code is On
Smilies are On
[IMG] code is Off
HTML code is Off



Similar Threads
Thread Thread Starter Forum Replies Last Post
IRQ error loading orinoco_cs dezert_fox Linux - Wireless Networking 7 11-29-2004 06:30 AM
When I try to make my ethernet driver under kernel 2.6.8.1 .. error. em0ng Linux - Software 0 09-26-2004 05:59 AM
ERROR running make when installing Nvidia drivers (syntax error) randyriver10 Linux - Software 5 02-21-2004 04:51 PM
linksys card (orinoco_cs driver) h/w Linux - Networking 0 11-12-2003 08:44 PM
Problem with Orinoco_cs driver under RedHat 8.0 spradeep1979 Linux - Networking 3 02-18-2003 05:17 PM

LinuxQuestions.org > Forums > Linux Forums > Linux - Newbie

All times are GMT -5. The time now is 01:05 AM.

Main Menu
Advertisement
My LQ
Write for LQ
LinuxQuestions.org is looking for people interested in writing Editorials, Articles, Reviews, and more. If you'd like to contribute content, let us know.
Main Menu
Syndicate
RSS1  Latest Threads
RSS1  LQ News
Twitter: @linuxquestions
Facebook: linuxquestions Google+: linuxquestions
Open Source Consulting | Domain Registration