LinuxQuestions.org
Welcome to the most active Linux Forum on the web.
Go Back   LinuxQuestions.org > Forums > Linux Forums > Linux - Newbie
User Name
Password
Linux - Newbie This Linux forum is for members that are new to Linux.
Just starting out and have a question? If it is not in the man pages or the how-to's this is the place!

Notices

Closed Thread
 
Search this Thread
Old 02-03-2006, 04:29 AM   #1
newcomer4
LQ Newbie
 
Registered: Jan 2006
Posts: 21

Rep: Reputation: 15
glibc compilation error


I am trying to build a cross compiliation toolchain.
After building bootstrap compiler, when I tried to build glibc completely I got an error.

To configure :
CC=i386-linux-gcc CC=${TARGET_PREFIX}/bin/gcc AR=${TARGET_PREFIX}/bin/ar RANLIB=${TARGET_PREFIX}/bin/ranlib AS=${TARGET_PREFIX}/bin/as LD=${TARGET_PREFIX}/bin/ld ../glibc-2.3.6/configure --build=i686-redhat-linux --host=$TARGET --target=$TARGET --prefix="/usr" --enable-add-ons=linuxthreads --with-headers=${TARGET_PREFIX}/include


To compile glibc:
make


After about 30-45 minutes of compilation,here comes the error
/home/sowmya/trial/embedded/tools/i386-linux/bin/gcc programs/ld-collate.c -c -std=gnu99 -O2 -Wall -Winline -Wstrict-prototypes -Wwrite-strings -g -mpreferred-stack-boundary=2 -DLOCALE_PATH='"/usr/lib/locale:/usr/share/i18n"' -DLOCALEDIR='"/usr/lib/locale"' -DLOCALE_ALIAS_PATH='"/usr/share/locale"' -DCHARMAP_PATH='"/usr/share/i18n/charmaps"' -DREPERTOIREMAP_PATH='"/usr/share/i18n/repertoiremaps"' -DLOCSRCDIR='"/usr/share/i18n/locales"' -DHAVE_CONFIG_H -Iprograms -I../include -I. -I/home/sowmya/trial/embedded/build-tools/build-glibc/locale -I.. -I../libio -I/home/sowmya/trial/embedded/build-tools/build-glibc -I../sysdeps/i386/elf -I../linuxthreads/sysdeps/unix/sysv/linux/i386 -I../linuxthreads/sysdeps/unix/sysv/linux -I../linuxthreads/sysdeps/pthread -I../sysdeps/pthread -I../linuxthreads/sysdeps/unix/sysv -I../linuxthreads/sysdeps/unix -I../linuxthreads/sysdeps/i386 -I../sysdeps/unix/sysv/linux/i386 -I../sysdeps/unix/sysv/linux -I../sysdeps/gnu -I../sysdeps/unix/common -I../sysdeps/unix/mman -I../sysdeps/unix/inet -I../sysdeps/unix/sysv/i386 -I../sysdeps/unix/sysv -I../sysdeps/unix/i386 -I../sysdeps/unix -I../sysdeps/posix -I../sysdeps/i386/fpu -I../sysdeps/i386 -I../sysdeps/wordsize-32 -I../sysdeps/ieee754/ldbl-96 -I../sysdeps/ieee754/dbl-64 -I../sysdeps/ieee754/flt-32 -I../sysdeps/ieee754 -I../sysdeps/generic/elf -I../sysdeps/generic -nostdinc -isystem /home/sowmya/trial/embedded/tools/lib/gcc/i386-linux/4.0.2/include -isystem /home/sowmya/trial/embedded/tools/i386-linux/include -D_LIBC_REENTRANT -include ../include/libc-symbols.h -DNOT_IN_libc=1 -o /home/sowmya/trial/embedded/build-tools/build-glibc/locale/ld-collate.o -MD -MP -MF /home/sowmya/trial/embedded/build-tools/build-glibc/locale/ld-collate.o.dt -MT /home/sowmya/trial/embedded/build-tools/build-glibc/locale/ld-collate.o
programs/ld-collate.c: In function ‘insert_value’:
programs/ld-collate.c:997: warning: pointer targets in passing argument 2 of ‘new_element’ differ in signedness
programs/ld-collate.c: In function ‘handle_ellipsis’:
programs/ld-collate.c:1391: warning: pointer targets in passing argument 2 of ‘new_element’ differ in signedness
programs/ld-collate.c: In function ‘collate_output’:
programs/ld-collate.c:2418: error: ‘lt’ undeclared (first use in this function)
programs/ld-collate.c:2418: error: (Each undeclared identifier is reported only once
programs/ld-collate.c:2418: error: for each function it appears in.)
programs/ld-collate.c:2418: error: ‘gt’ undeclared (first use in this function)
programs/ld-collate.c:2418: error: syntax error before ‘;’ token
programs/ld-collate.c:2418: error: ‘level1_size’ undeclared (first use in this function)
programs/ld-collate.c:2418: error: syntax error before ‘)’ token
programs/ld-collate.c:2418: error: ‘level1’ undeclared (first use in this function)
programs/ld-collate.c:2418: error: ‘lookup1’ undeclared (first use in this function)
programs/ld-collate.c:2418: error: ‘q’ undeclared (first use in this function)
programs/ld-collate.c:2418: error: syntax error before ‘;’ token
programs/ld-collate.c:2418: error: syntax error before ‘)’ token
programs/ld-collate.c:2418: error: ‘level2’ undeclared (first use in this function)
programs/ld-collate.c:2418: error: ‘lookup2’ undeclared (first use in this function)
programs/ld-collate.c:2418: error: ‘p’ undeclared (first use in this function)
programs/ld-collate.c:2418: error: syntax error before ‘;’ token
programs/ld-collate.c:2418: error: syntax error before ‘)’ token
programs/ld-collate.c:2418: error: ‘level3’ undeclared (first use in this function)
programs/ld-collate.c:2418: error: ‘lookup3’ undeclared (first use in this function)
programs/ld-collate.c:2418: error: syntax error before ‘;’ token
programs/ld-collate.c:2418: error: syntax error before ‘;’ token
programs/ld-collate.c:2418: error: syntax error before ‘}’ token
programs/ld-collate.c: At top level:
programs/ld-collate.c:2420: error: syntax error before ‘&’ token
programs/ld-collate.c:2420: warning: type defaults to ‘int’ in declaration of ‘collidx_table_finalize’
programs/ld-collate.c:2420: warning: function declaration isn’t a prototype
programs/ld-collate.c:2420: error: conflicting types for ‘collidx_table_finalize’
programs/3level.h:249: error: previous definition of ‘collidx_table_finalize’ was here
programs/ld-collate.c:2420: warning: data definition has no type or storage class
programs/ld-collate.c:2424: error: syntax error before ‘void’
programs/ld-collate.c:2425: error: syntax error before ‘.’ token
programs/ld-collate.c:2426: error: syntax error before ‘.’ token
programs/ld-collate.c:2427: warning: type defaults to ‘int’ in declaration of ‘idx’
programs/ld-collate.c:2427: error: variable-sized object may not be initialized
programs/ld-collate.c:2427: warning: data definition has no type or storage class
programs/ld-collate.c:2428: error: syntax error before ‘void’
programs/ld-collate.c:2429: error: syntax error before ‘void’
programs/ld-collate.c:2432: error: syntax error before ‘void’
programs/ld-collate.c:2433: error: syntax error before ‘.’ token
programs/ld-collate.c:2434: error: syntax error before ‘.’ token
programs/ld-collate.c:2434: error: ‘__o1’ undeclared here (not in a function)
programs/ld-collate.c:2434: error: syntax error before ‘if’
programs/ld-collate.c:2434: warning: type defaults to ‘int’ in declaration of ‘__value’
programs/ld-collate.c:2434: error: conflicting types for ‘__value’
programs/ld-collate.c:2434: error: previous definition of ‘__value’ was here
programs/ld-collate.c:2434: warning: data definition has no type or storage class
programs/ld-collate.c:2434: error: syntax error before ‘}’ token
programs/ld-collate.c:2435: warning: type defaults to ‘int’ in declaration of ‘idx’
programs/ld-collate.c:2435: error: variable-sized object may not be initialized
programs/ld-collate.c:2435: warning: data definition has no type or storage class
programs/ld-collate.c:2436: error: syntax error before ‘void’
programs/ld-collate.c:2437: error: syntax error before ‘void’
programs/ld-collate.c:2440: error: syntax error before ‘void’
programs/ld-collate.c:2441: error: syntax error before ‘.’ token
programs/ld-collate.c:2442: error: syntax error before ‘.’ token
programs/ld-collate.c:2442: error: conflicting types for ‘__value’
programs/ld-collate.c:2434: error: previous declaration of ‘__value’ was here
programs/ld-collate.c:2442: error: syntax error before ‘if’
programs/ld-collate.c:2442: warning: type defaults to ‘int’ in declaration of ‘__value’
programs/ld-collate.c:2442: error: conflicting types for ‘__value’
programs/ld-collate.c:2442: error: previous definition of ‘__value’ was here
programs/ld-collate.c:2442: warning: data definition has no type or storage class
programs/ld-collate.c:2442: error: syntax error before ‘}’ token
programs/ld-collate.c:2443: warning: type defaults to ‘int’ in declaration of ‘idx’
programs/ld-collate.c:2443: error: variable-sized object may not be initialized
programs/ld-collate.c:2443: warning: data definition has no type or storage class
programs/ld-collate.c:2444: error: syntax error before ‘void’
programs/ld-collate.c:2445: error: syntax error before ‘void’
programs/ld-collate.c:2448: error: syntax error before ‘void’
programs/ld-collate.c:2449: error: syntax error before ‘.’ token
programs/ld-collate.c:2450: error: syntax error before ‘.’ token
programs/ld-collate.c:2450: error: conflicting types for ‘__value’
programs/ld-collate.c:2442: error: previous declaration of ‘__value’ was here
programs/ld-collate.c:2450: error: syntax error before ‘if’
programs/ld-collate.c:2450: warning: type defaults to ‘int’ in declaration of ‘__value’
programs/ld-collate.c:2450: error: conflicting types for ‘__value’
programs/ld-collate.c:2450: error: previous definition of ‘__value’ was here
programs/ld-collate.c:2450: warning: data definition has no type or storage class
programs/ld-collate.c:2450: error: syntax error before ‘}’ token
programs/ld-collate.c:2451: warning: type defaults to ‘int’ in declaration of ‘idx’
programs/ld-collate.c:2451: error: variable-sized object may not be initialized
programs/ld-collate.c:2451: warning: data definition has no type or storage class
programs/ld-collate.c:2452: error: syntax error before ‘void’
programs/ld-collate.c:2453: error: syntax error before ‘void’
programs/ld-collate.c:2468: warning: type defaults to ‘int’ in declaration of ‘elem_size’
programs/ld-collate.c:2468: warning: data definition has no type or storage class
programs/ld-collate.c:2469: warning: type defaults to ‘int’ in declaration of ‘runp’
programs/ld-collate.c:2469: warning: initialization makes integer from pointer without a cast
programs/ld-collate.c:2469: warning: data definition has no type or storage class
programs/ld-collate.c:2470: error: syntax error before ‘while’
programs/ld-collate.c:2476: warning: type defaults to ‘int’ in declaration of ‘runp’
programs/ld-collate.c:2476: error: redefinition of ‘runp’
programs/ld-collate.c:2469: error: previous definition of ‘runp’ was here
programs/ld-collate.c:2476: error: invalid type argument of ‘->’
programs/ld-collate.c:2476: warning: data definition has no type or storage class
programs/ld-collate.c:2477: error: syntax error before ‘}’ token
programs/ld-collate.c:2479: warning: type defaults to ‘int’ in declaration of ‘elem_size’
programs/ld-collate.c:2479: error: redefinition of ‘elem_size’
programs/ld-collate.c:2468: error: previous definition of ‘elem_size’ was here
programs/ld-collate.c:2479: warning: data definition has no type or storage class
programs/ld-collate.c:2485: warning: type defaults to ‘int’ in declaration of ‘elem_table’
programs/ld-collate.c:2485: error: braced-group within expression allowed only inside a function
programs/ld-collate.c:2485: warning: data definition has no type or storage class
programs/ld-collate.c:2485: error: syntax error before ‘{’ token
programs/ld-collate.c:2485: error: syntax error before ‘if’
programs/ld-collate.c:2485: error: syntax error before ‘->’ token
programs/ld-collate.c:2485: error: syntax error before ‘{’ token
programs/ld-collate.c:2485: error: conflicting types for ‘__value’
programs/ld-collate.c:2450: error: previous declaration of ‘__value’ was here
programs/ld-collate.c:2485: error: syntax error before ‘if’
programs/ld-collate.c:2485: warning: type defaults to ‘int’ in declaration of ‘__value’
programs/ld-collate.c:2485: error: conflicting types for ‘__value’
programs/ld-collate.c:2485: error: previous definition of ‘__value’ was here
programs/ld-collate.c:2485: warning: data definition has no type or storage class
programs/ld-collate.c:2485: error: syntax error before ‘}’ token
programs/ld-collate.c:2487: error: syntax error before '\x0'
programs/ld-collate.c:2490: warning: type defaults to ‘int’ in declaration of ‘runp’
programs/ld-collate.c:2490: error: redefinition of ‘runp’
programs/ld-collate.c:2476: error: previous definition of ‘runp’ was here
programs/ld-collate.c:2490: warning: initialization makes integer from pointer without a cast
programs/ld-collate.c:2490: warning: data definition has no type or storage class
programs/ld-collate.c:2491: error: syntax error before ‘while’
programs/ld-collate.c:2497: error: invalid type argument of ‘->’
programs/ld-collate.c:2497: error: ‘namelen’ undeclared here (not in a function)
programs/ld-collate.c:2498: error: conflicting types for ‘idx’
programs/ld-collate.c:2451: error: previous declaration of ‘idx’ was here
programs/ld-collate.c:2500: error: syntax error before ‘if’
programs/ld-collate.c:2515: warning: type defaults to ‘int’ in declaration of ‘elem_table’
programs/ld-collate.c:2515: error: variable-sized object may not be initialized
programs/ld-collate.c:2515: error: conflicting types for ‘elem_table’
programs/ld-collate.c:2485: error: previous definition of ‘elem_table’ was here
programs/ld-collate.c:2515: warning: data definition has no type or storage class
programs/ld-collate.c:2516: warning: type defaults to ‘int’ in declaration of ‘elem_table’
programs/ld-collate.c:2516: error: variable-sized object may not be initialized
programs/ld-collate.c:2516: error: braced-group within expression allowed only inside a function
programs/ld-collate.c:2519: error: syntax error before ‘{’ token
programs/ld-collate.c:2519: error: syntax error before ‘->’ token
programs/ld-collate.c:2520: error: syntax error before ‘{’ token
programs/ld-collate.c:2520: error: redefinition of ‘__len’
programs/ld-collate.c:2485: error: previous definition of ‘__len’ was here
programs/ld-collate.c:2520: error: syntax error before ‘if’
programs/ld-collate.c:2520: error: syntax error before ‘->’ token
programs/ld-collate.c:2520: warning: type defaults to ‘int’ in declaration of ‘memcpy’
programs/ld-collate.c:2520: warning: function declaration isn’t a prototype
programs/ld-collate.c:2520: error: conflicting types for ‘memcpy’
programs/ld-collate.c:2520: warning: data definition has no type or storage class
programs/ld-collate.c:2520: error: syntax error before ‘->’ token
programs/ld-collate.c:2523: error: syntax error before ‘{’ token
programs/ld-collate.c:2523: error: syntax error before ‘->’ token
programs/ld-collate.c:2524: error: syntax error before ‘{’ token
programs/ld-collate.c:2524: error: redefinition of ‘__len’
programs/ld-collate.c:2520: error: previous definition of ‘__len’ was here
programs/ld-collate.c:2524: error: invalid type argument of ‘->’
programs/ld-collate.c:2524: error: syntax error before ‘if’
programs/ld-collate.c:2524: error: syntax error before ‘->’ token
programs/ld-collate.c:2524: warning: type defaults to ‘int’ in declaration of ‘memcpy’
programs/ld-collate.c:2524: warning: function declaration isn’t a prototype
programs/ld-collate.c:2524: warning: data definition has no type or storage class
programs/ld-collate.c:2524: error: syntax error before ‘->’ token
programs/ld-collate.c:2528: error: redefinition of ‘__len’
programs/ld-collate.c:2524: error: previous definition of ‘__len’ was here
programs/ld-collate.c:2528: error: invalid type argument of ‘->’
programs/ld-collate.c:2528: error: syntax error before ‘if’
programs/ld-collate.c:2528: error: syntax error before ‘->’ token
programs/ld-collate.c:2528: warning: type defaults to ‘int’ in declaration of ‘memcpy’
programs/ld-collate.c:2528: warning: function declaration isn’t a prototype
programs/ld-collate.c:2528: warning: data definition has no type or storage class
programs/ld-collate.c:2528: error: syntax error before ‘->’ token
programs/ld-collate.c:2536: error: syntax error before ‘&’ token
programs/ld-collate.c:2536: warning: type defaults to ‘int’ in declaration of ‘obstack_int32_grow’
programs/ld-collate.c:2536: warning: function declaration isn’t a prototype
programs/ld-collate.c:2536: error: conflicting types for ‘obstack_int32_grow’
programs/ld-collate.c:47: error: previous definition of ‘obstack_int32_grow’ was here
programs/ld-collate.c:2536: warning: data definition has no type or storage class
programs/ld-collate.c:2538: error: syntax error before ‘&’ token
programs/ld-collate.c:2538: warning: type defaults to ‘int’ in declaration of ‘obstack_int32_grow’
programs/ld-collate.c:2538: warning: function declaration isn’t a prototype
programs/ld-collate.c:2538: warning: data definition has no type or storage class
programs/ld-collate.c:2539: error: syntax error before ‘{’ token
programs/ld-collate.c:2539: error: redefinition of ‘__len’
programs/ld-collate.c:2528: error: previous definition of ‘__len’ was here
programs/ld-collate.c:2539: error: invalid type argument of ‘->’
programs/ld-collate.c:2539: error: syntax error before ‘if’
programs/ld-collate.c:2539: error: syntax error before ‘->’ token
programs/ld-collate.c:2539: warning: type defaults to ‘int’ in declaration of ‘memcpy’
programs/ld-collate.c:2539: warning: function declaration isn’t a prototype
programs/ld-collate.c:2539: warning: data definition has no type or storage class
programs/ld-collate.c:2539: error: syntax error before ‘->’ token
programs/ld-collate.c:2542: error: syntax error before ‘&’ token
programs/ld-collate.c:2542: warning: type defaults to ‘int’ in declaration of ‘obstack_int32_grow’
programs/ld-collate.c:2542: warning: function declaration isn’t a prototype
programs/ld-collate.c:2542: warning: data definition has no type or storage class
programs/ld-collate.c:2545: warning: type defaults to ‘int’ in declaration of ‘runp’
programs/ld-collate.c:2545: error: redefinition of ‘runp’
programs/ld-collate.c:2490: error: previous definition of ‘runp’ was here
programs/ld-collate.c:2545: error: invalid type argument of ‘->’
programs/ld-collate.c:2545: warning: data definition has no type or storage class
programs/ld-collate.c:2546: error: syntax error before ‘}’ token
programs/ld-collate.c:2549: error: syntax error before ‘void’
programs/ld-collate.c:2550: error: syntax error before ‘.’ token
programs/ld-collate.c:2551: error: syntax error before ‘.’ token
programs/ld-collate.c:2552: warning: type defaults to ‘int’ in declaration of ‘idx’
programs/ld-collate.c:2552: error: variable-sized object may not be initialized
programs/ld-collate.c:2552: error: conflicting types for ‘idx’
programs/ld-collate.c:2498: error: previous definition of ‘idx’ was here
programs/ld-collate.c:2552: warning: data definition has no type or storage class
programs/ld-collate.c:2553: error: syntax error before ‘void’
programs/ld-collate.c:2556: error: syntax error before ‘void’
programs/ld-collate.c:2557: error: syntax error before ‘.’ token
programs/ld-collate.c:2558: error: syntax error before ‘.’ token
programs/ld-collate.c:2559: warning: type defaults to ‘int’ in declaration of ‘idx’
programs/ld-collate.c:2559: error: variable-sized object may not be initialized
programs/ld-collate.c:2559: warning: data definition has no type or storage class
programs/ld-collate.c:2560: error: syntax error before ‘void’
programs/ld-collate.c:2563: error: syntax error before ‘void’
programs/ld-collate.c:2564: error: syntax error before ‘.’ token
programs/ld-collate.c:2565: error: syntax error before ‘.’ token
programs/ld-collate.c:2565: error: conflicting types for ‘__value’
programs/ld-collate.c:2485: error: previous declaration of ‘__value’ was here
programs/ld-collate.c:2565: error: syntax error before ‘if’
programs/ld-collate.c:2565: warning: type defaults to ‘int’ in declaration of ‘__value’
programs/ld-collate.c:2565: error: conflicting types for ‘__value’
programs/ld-collate.c:2565: error: previous definition of ‘__value’ was here
programs/ld-collate.c:2565: warning: data definition has no type or storage class
programs/ld-collate.c:2565: error: syntax error before ‘}’ token
programs/ld-collate.c:2566: warning: type defaults to ‘int’ in declaration of ‘idx’
programs/ld-collate.c:2566: error: variable-sized object may not be initialized
programs/ld-collate.c:2566: warning: data definition has no type or storage class
programs/ld-collate.c:2567: error: syntax error before ‘++’ token
programs/ld-collate.c:2569: error: syntax error before ‘void’
programs/ld-collate.c:2570: error: syntax error before ‘.’ token
programs/ld-collate.c:2571: error: syntax error before ‘.’ token
programs/ld-collate.c:2572: warning: type defaults to ‘int’ in declaration of ‘idx’
programs/ld-collate.c:2572: error: variable-sized object may not be initialized
programs/ld-collate.c:2572: warning: data definition has no type or storage class
programs/ld-collate.c:2573: error: syntax error before ‘++’ token
programs/ld-collate.c:2575: error: syntax error before ‘void’
programs/ld-collate.c:2576: error: syntax error before ‘.’ token
programs/ld-collate.c:2577: error: syntax error before ‘.’ token
programs/ld-collate.c:2578: warning: type defaults to ‘int’ in declaration of ‘idx’
programs/ld-collate.c:2578: error: variable-sized object may not be initialized
programs/ld-collate.c:2578: warning: data definition has no type or storage class
programs/ld-collate.c:2579: error: syntax error before ‘void’
programs/ld-collate.c:2582: error: syntax error before ‘void’
programs/ld-collate.c:2583: error: syntax error before ‘.’ token
programs/ld-collate.c:2584: error: syntax error before ‘.’ token
programs/ld-collate.c:2587: error: syntax error before ‘void’
programs/ld-collate.c:2589: error: syntax error before string constant
programs/ld-collate.c:2589: warning: type defaults to ‘int’ in declaration of ‘write_locale_data’programs/ld-collate.c:2589: warning: function declaration isn’t a prototype
programs/ld-collate.c:2589: error: conflicting types for ‘write_locale_data’
programs/locfile.h:72: error: previous declaration of ‘write_locale_data’ was here
programs/ld-collate.c:2589: warning: data definition has no type or storage class
programs/ld-collate.c:2591: error: syntax error before ‘{’ token
programs/ld-collate.c:2591: error: syntax error before ‘if’
programs/ld-collate.c:2592: error: syntax error before ‘{’ token
programs/ld-collate.c:2592: error: redefinition of ‘__obj’
programs/ld-collate.c:2591: error: previous definition of ‘__obj’ was here
programs/ld-collate.c:2592: error: syntax error before ‘if’
programs/ld-collate.c:2593: error: syntax error before ‘{’ token
programs/ld-collate.c:2593: error: redefinition of ‘__obj’
programs/ld-collate.c:2592: error: previous definition of ‘__obj’ was here
programs/ld-collate.c:2593: error: syntax error before ‘if’
programs/ld-collate.c:2593: warning: unused variable ‘__obj’
programs/ld-collate.c:2592: warning: unused variable ‘__obj’
programs/ld-collate.c:2591: warning: unused variable ‘__obj’
programs/ld-collate.c:2565: warning: unused variable ‘__value’
programs/ld-collate.c:2565: warning: unused variable ‘__value’
programs/ld-collate.c:2539: warning: unused variable ‘__len’
programs/ld-collate.c:2528: warning: unused variable ‘__len’
programs/ld-collate.c:2524: warning: unused variable ‘__len’
programs/ld-collate.c:2520: warning: unused variable ‘__len’
programs/ld-collate.c:2516: warning: unused variable ‘elem_table’
programs/ld-collate.c:2485: warning: unused variable ‘__value’
programs/ld-collate.c:2485: warning: unused variable ‘__value’
programs/ld-collate.c:2485: warning: unused variable ‘__len’
programs/ld-collate.c:2485: warning: unused variable ‘elem_table’
programs/ld-collate.c:2469: warning: unused variable ‘runp’
programs/ld-collate.c:2468: warning: unused variable ‘elem_size’
programs/ld-collate.c:2450: warning: unused variable ‘__value’
programs/ld-collate.c:2450: warning: unused variable ‘__value’
programs/ld-collate.c:2442: warning: unused variable ‘__value’
programs/ld-collate.c:2442: warning: unused variable ‘__value’
programs/ld-collate.c:2434: warning: unused variable ‘__value’
programs/ld-collate.c:2434: warning: unused variable ‘__value’
programs/ld-collate.c:1960: warning: unused variable ‘runp’
programs/ld-collate.c:1958: warning: unused variable ‘elem_table’
programs/ld-collate.c:1957: warning: unused variable ‘elem_size’
make[2]: *** [/home/sowmya/trial/embedded/build-tools/build-glibc/locale/ld-collate.o] Error 1
make[2]: Leaving directory `/home/sowmya/trial/embedded/build-tools/glibc-2.3.6/locale'
make[1]: *** [locale/others] Error 2
make[1]: Leaving directory `/home/sowmya/trial/embedded/build-tools/glibc-2.3.6'
make: *** [all] Error 2


Can anyone help me........plz
 
Old 02-03-2006, 02:53 PM   #2
Tinkster
Moderator
 
Registered: Apr 2002
Location: in a fallen world
Distribution: slackware by choice, others too :} ... android.
Posts: 22,965
Blog Entries: 11

Rep: Reputation: 865Reputation: 865Reputation: 865Reputation: 865Reputation: 865Reputation: 865Reputation: 865
Please do not post the same thread in more than one forum. Picking the most relevant forum and posting it once there makes it easier for other members to help you and keeps the discussion all in one place.

http://www.linuxquestions.org/rules.php
 
  


Closed Thread


Thread Tools Search this Thread
Search this Thread:

Advanced Search

Posting Rules
You may not post new threads
You may not post replies
You may not post attachments
You may not edit your posts

BB code is On
Smilies are On
[IMG] code is Off
HTML code is Off


Similar Threads
Thread Thread Starter Forum Replies Last Post
Kernel compilation error: Error 15: File not found Niceman2005 Linux - General 9 10-04-2007 03:45 AM
Glibc compilation error Krappy Linux From Scratch 0 05-03-2005 12:24 AM
Mplayer compilation problem on linux 2.6.3 gcc 3.3.3 glibc 2.3.2 realloc Linux - Software 4 10-22-2004 03:44 PM
Sorry (Re: strange Glibc compilation problem) Blaza Linux - General 3 09-01-2004 05:28 PM
Sqwebmail compilation error ... [maildirsearchC.o] Error 1 boogie_maan Linux - Software 0 10-26-2002 07:21 PM


All times are GMT -5. The time now is 09:49 AM.

Main Menu
My LQ
Write for LQ
LinuxQuestions.org is looking for people interested in writing Editorials, Articles, Reviews, and more. If you'd like to contribute content, let us know.
Main Menu
Syndicate
RSS1  Latest Threads
RSS1  LQ News
Twitter: @linuxquestions
identi.ca: @linuxquestions
Facebook: linuxquestions Google+: linuxquestions
Open Source Consulting | Domain Registration