LinuxQuestions.org
Support LQ: Use code LQ3 and save $3 on Domain Registration
Go Back   LinuxQuestions.org > Forums > Linux Forums > Linux - Newbie
User Name
Password
Linux - Newbie This Linux forum is for members that are new to Linux.
Just starting out and have a question? If it is not in the man pages or the how-to's this is the place!

Notices


Reply
  Search this Thread
Old 09-30-2008, 04:58 AM   #1
zahidul
LQ Newbie
 
Registered: Sep 2008
Posts: 21

Rep: Reputation: 15
Question error while compiling linux kernel 2.6.26.3


hi all,

i m cross-compiling linux kernel 2.6.26.3 for my ARM PXA processor.while running the make command i got the following error messages:

drivers/net/b44.c: In function `b44_sync_dma_desc_for_device':
drivers/net/b44.c:151: error: implicit declaration of function `dma_sync_single_range_for_device'
drivers/net/b44.c: In function `b44_sync_dma_desc_for_cpu':
drivers/net/b44.c:161: error: implicit declaration of function `dma_sync_single_range_for_cpu'
make[2]: *** [drivers/net/b44.o] Error 1
make[1]: *** [drivers/net] Error 2
make: *** [drivers] Error 2

can anyone help me to rectify for errors
 
Old 10-01-2008, 03:14 AM   #2
jmbrink26
Member
 
Registered: Aug 2006
Posts: 72

Rep: Reputation: 15
Did you change any kernel module declarations in the ncurses menu before you compiled the new kernel version?

It sounds like there are missing kernel module dependencies necessary to compile and run the kernel.
 
  


Reply


Thread Tools Search this Thread
Search this Thread:

Advanced Search

Posting Rules
You may not post new threads
You may not post replies
You may not post attachments
You may not edit your posts

BB code is On
Smilies are On
[IMG] code is Off
HTML code is Off



Similar Threads
Thread Thread Starter Forum Replies Last Post
error while compiling linux kernel 2.6 V zahidul Linux - Newbie 5 05-17-2009 08:29 AM
Error when compiling kernel linux-2.6.22 : make: ***[_modinst_post] Error 137 ngoclan.it Linux - General 1 12-11-2007 07:54 AM
Error when compiling kernel linux-2.6.22 : make: ***[_modinst_post] Error 137 ngoclan.it Linux - Newbie 0 12-11-2007 07:49 AM
Error while compiling Linux 2.6.5-7 Kernel Kizio Linux - Software 4 12-13-2004 09:45 PM
error compiling the kernel linux-2.6.5 shams Mandriva 9 05-25-2004 10:44 PM


All times are GMT -5. The time now is 09:00 PM.

Main Menu
Advertisement
My LQ
Write for LQ
LinuxQuestions.org is looking for people interested in writing Editorials, Articles, Reviews, and more. If you'd like to contribute content, let us know.
Main Menu
Syndicate
RSS1  Latest Threads
RSS1  LQ News
Twitter: @linuxquestions
Facebook: linuxquestions Google+: linuxquestions
Open Source Consulting | Domain Registration