LinuxQuestions.org

LinuxQuestions.org (/questions/)
-   Linux - Networking (http://www.linuxquestions.org/questions/linux-networking-3/)
-   -   Error setting up Web100 bandwidth testing app (http://www.linuxquestions.org/questions/linux-networking-3/error-setting-up-web100-bandwidth-testing-app-457758/)

eWebtricity 06-24-2006 01:04 AM

Error setting up Web100 bandwidth testing app
 
Troubleshooting a new installation of Web100 but can't seem to make any progress, any suggestions would be appreciated.

Background:
Code:

Installed CentOS 4.3 and chose a custom setup, removed all partitions and let it auto-partition using LVM and then choose the minimal packages option.

# yum install gcc

# yum install kernel-devel

# cd /usr/local/src

# wget *first post and it complained about urls*/linux-2.6.16.tar.gz

# wget *first post and it complained about urls*/web100-2.5.10-200604071159.tar.gz

# tar -zxvf web100-2.5.10-200604071159.tar.gz

# tar -C /usr/src -zxvf linux-2.6.16.tar.gz

# rm -rf /usr/src/linux

# ln -s /usr/src/linux-2.6.16 /usr/src/linux

# cd /usr/src/linux

# patch -p1 < /usr/local/src/web100/web100-2.6.16-2.5.10-200604071159.patch

# cp /usr/src/kernels/2.6.9-34.0.1.EL-i686/.config ./config.save

# make mrproper

# cp config.save .config

# make menuconfig

Here's where the fun begins...

----------------- error -------------------------

# make menuconfig
  HOSTCC  scripts/basic/fixdep
  HOSTCC  scripts/basic/split-include
  HOSTCC  scripts/basic/docproc
  HOSTCC  scripts/kconfig/conf.o
  HOSTCC  scripts/kconfig/kxgettext.o
  HOSTCC  scripts/kconfig/mconf.o
  SHIPPED scripts/kconfig/zconf.tab.c
  SHIPPED scripts/kconfig/lex.zconf.c
  SHIPPED scripts/kconfig/zconf.hash.c
  HOSTCC  scripts/kconfig/zconf.tab.o
  HOSTLD  scripts/kconfig/mconf
  HOSTCC  scripts/kconfig/lxdialog/checklist.o
In file included from scripts/kconfig/lxdialog/checklist.c:24:
scripts/kconfig/lxdialog/dialog.h:31:20: curses.h: No such file or directory
In file included from scripts/kconfig/lxdialog/checklist.c:24:
scripts/kconfig/lxdialog/dialog.h:128: error: syntax error before "use_colors"
scripts/kconfig/lxdialog/dialog.h:128: warning: type defaults to `int' in declaration of `use_colors'
scripts/kconfig/lxdialog/dialog.h:128: warning: data definition has no type or storage class
scripts/kconfig/lxdialog/dialog.h:129: error: syntax error before "use_shadow"
scripts/kconfig/lxdialog/dialog.h:129: warning: type defaults to `int' in declaration of `use_shadow'
scripts/kconfig/lxdialog/dialog.h:129: warning: data definition has no type or storage class
scripts/kconfig/lxdialog/dialog.h:131: error: syntax error before "attributes"
scripts/kconfig/lxdialog/dialog.h:131: warning: type defaults to `int' in declaration of `attributes'
scripts/kconfig/lxdialog/dialog.h:131: warning: data definition has no type or storage class
scripts/kconfig/lxdialog/dialog.h:143: error: syntax error before '*' token
scripts/kconfig/lxdialog/dialog.h:143: warning: function declaration isn't a prototype
scripts/kconfig/lxdialog/dialog.h:146: error: syntax error before '*' token
scripts/kconfig/lxdialog/dialog.h:146: warning: function declaration isn't a prototype
scripts/kconfig/lxdialog/dialog.h:147: error: syntax error before '*' token
scripts/kconfig/lxdialog/dialog.h:147: warning: function declaration isn't a prototype
scripts/kconfig/lxdialog/dialog.h:148: error: syntax error before '*' token
scripts/kconfig/lxdialog/dialog.h:148: warning: function declaration isn't a prototype
scripts/kconfig/lxdialog/dialog.h:149: error: syntax error before '*' token
scripts/kconfig/lxdialog/dialog.h:150: warning: function declaration isn't a prototype
scripts/kconfig/lxdialog/dialog.h:151: error: syntax error before '*' token
scripts/kconfig/lxdialog/dialog.h:151: warning: function declaration isn't a prototype
scripts/kconfig/lxdialog/checklist.c:31: error: syntax error before '*' token
scripts/kconfig/lxdialog/checklist.c:33: warning: function declaration isn't a prototype
scripts/kconfig/lxdialog/checklist.c: In function `print_item':
scripts/kconfig/lxdialog/checklist.c:37: warning: implicit declaration of function `wattrset'
scripts/kconfig/lxdialog/checklist.c:37: error: `win' undeclared (first use in this function)
scripts/kconfig/lxdialog/checklist.c:37: error: (Each undeclared identifier is reported only once
scripts/kconfig/lxdialog/checklist.c:37: error: for each function it appears in.)
scripts/kconfig/lxdialog/checklist.c:38: warning: implicit declaration of function `wmove'
scripts/kconfig/lxdialog/checklist.c:38: error: `choice' undeclared (first use in this function)
scripts/kconfig/lxdialog/checklist.c:40: warning: implicit declaration of function `waddch'
scripts/kconfig/lxdialog/checklist.c:43: error: `selected' undeclared (first use in this function)
scripts/kconfig/lxdialog/checklist.c:44: warning: implicit declaration of function `wprintw'
scripts/kconfig/lxdialog/checklist.c:44: error: `status' undeclared (first use in this function)
scripts/kconfig/lxdialog/checklist.c:47: warning: implicit declaration of function `mvwaddch'
scripts/kconfig/lxdialog/checklist.c:47: error: `item' undeclared (first use in this function)
scripts/kconfig/lxdialog/checklist.c:49: warning: implicit declaration of function `waddstr'
scripts/kconfig/lxdialog/checklist.c:52: warning: implicit declaration of function `wrefresh'
scripts/kconfig/lxdialog/checklist.c: At top level:
scripts/kconfig/lxdialog/checklist.c:59: error: syntax error before '*' token
scripts/kconfig/lxdialog/checklist.c:61: warning: function declaration isn't a prototype
scripts/kconfig/lxdialog/checklist.c: In function `print_arrows':
scripts/kconfig/lxdialog/checklist.c:62: error: `win' undeclared (first use in this function)
scripts/kconfig/lxdialog/checklist.c:62: error: `y' undeclared (first use in this function)
scripts/kconfig/lxdialog/checklist.c:62: error: `x' undeclared (first use in this function)
scripts/kconfig/lxdialog/checklist.c:64: error: `scroll' undeclared (first use in this function)
scripts/kconfig/lxdialog/checklist.c:76: error: `height' undeclared (first use in this function)
scripts/kconfig/lxdialog/checklist.c:79: error: `item_no' undeclared (first use in this function)
scripts/kconfig/lxdialog/checklist.c:79: error: `choice' undeclared (first use in this function)
scripts/kconfig/lxdialog/checklist.c: At top level:
scripts/kconfig/lxdialog/checklist.c:95: error: syntax error before '*' token
scripts/kconfig/lxdialog/checklist.c:96: warning: function declaration isn't a prototype
scripts/kconfig/lxdialog/checklist.c: In function `print_buttons':
scripts/kconfig/lxdialog/checklist.c:97: error: `width' undeclared (first use in this function)
scripts/kconfig/lxdialog/checklist.c:98: error: `height' undeclared (first use in this function)
scripts/kconfig/lxdialog/checklist.c:100: error: `dialog' undeclared (first use in this function)
scripts/kconfig/lxdialog/checklist.c:100: error: `selected' undeclared (first use in this function)
scripts/kconfig/lxdialog/checklist.c: In function `dialog_checklist':
scripts/kconfig/lxdialog/checklist.c:117: error: `WINDOW' undeclared (first use in this function)
scripts/kconfig/lxdialog/checklist.c:117: error: `dialog' undeclared (first use in this function)
scripts/kconfig/lxdialog/checklist.c:117: error: `list' undeclared (first use in this function)
scripts/kconfig/lxdialog/checklist.c:117: warning: left-hand operand of comma expression has no effect
scripts/kconfig/lxdialog/checklist.c:121: warning: implicit declaration of function `endwin'
scripts/kconfig/lxdialog/checklist.c:122: warning: implicit declaration of function `fprintf'
scripts/kconfig/lxdialog/checklist.c:122: error: `stderr' undeclared (first use in this function)
scripts/kconfig/lxdialog/checklist.c:140: error: `COLS' undeclared (first use in this function)
scripts/kconfig/lxdialog/checklist.c:141: error: `LINES' undeclared (first use in this function)
scripts/kconfig/lxdialog/checklist.c:143: error: `stdscr' undeclared (first use in this function)
scripts/kconfig/lxdialog/checklist.c:145: warning: implicit declaration of function `newwin'
scripts/kconfig/lxdialog/checklist.c:146: warning: implicit declaration of function `keypad'
scripts/kconfig/lxdialog/checklist.c:146: error: `TRUE' undeclared (first use in this function)
scripts/kconfig/lxdialog/checklist.c:166: warning: implicit declaration of function `subwin'
scripts/kconfig/lxdialog/checklist.c:199: warning: implicit declaration of function `wnoutrefresh'
scripts/kconfig/lxdialog/checklist.c:201: warning: implicit declaration of function `doupdate'
scripts/kconfig/lxdialog/checklist.c:204: warning: implicit declaration of function `wgetch'
scripts/kconfig/lxdialog/checklist.c:211: error: `KEY_UP' undeclared (first use in this function)
scripts/kconfig/lxdialog/checklist.c:211: error: `KEY_DOWN' undeclared (first use in this function)
scripts/kconfig/lxdialog/checklist.c:221: error: `FALSE' undeclared (first use in this function)
scripts/kconfig/lxdialog/checklist.c:222: warning: implicit declaration of function `scrollok'
scripts/kconfig/lxdialog/checklist.c:223: warning: implicit declaration of function `wscrl'
scripts/kconfig/lxdialog/checklist.c:284: warning: implicit declaration of function `delwin'
scripts/kconfig/lxdialog/checklist.c:288: error: `KEY_LEFT' undeclared (first use in this function)
scripts/kconfig/lxdialog/checklist.c:289: error: `KEY_RIGHT' undeclared (first use in this function)
scripts/kconfig/lxdialog/checklist.c:117: warning: statement with no effect
scripts/kconfig/lxdialog/checklist.c: At top level:
scripts/kconfig/lxdialog/dialog.h:131: warning: array 'attributes' assumed to have one element
make[2]: *** [scripts/kconfig/lxdialog/checklist.o] Error 1
make[1]: *** [menuconfig] Error 2
make: *** [menuconfig] Error 2
[root@localhost linux]#

-------------------- end error -----------------------------


eWebtricity 06-25-2006 11:12 PM

Solved it. I was missing ncurses-devel package which I was easily able to install via yum.


All times are GMT -5. The time now is 10:25 AM.