LinuxQuestions.org
LinuxAnswers - the LQ Linux tutorial section.
Go Back   LinuxQuestions.org > Forums > Linux Forums > Linux - Networking
User Name
Password
Linux - Networking This forum is for any issue related to networks or networking.
Routing, network cards, OSI, etc. Anything is fair game.

Notices



Reply
 
Search this Thread
Old 12-13-2003, 09:56 AM   #1
cynth33_2000
LQ Newbie
 
Registered: Dec 2003
Distribution: Red Hat 9
Posts: 5

Rep: Reputation: 0
Error messages show up after run "make all"


Currently I'm trying to make my USB wireless network to work, so I download the atmel driver and when I start to install the Atmel driver by typing
# make config
that went fine and then I run
# make clean
This part is ok too. The probalem is when I run
# make all
It gives me some errors at the end.

Building src/usb src/apps/cmd_line
make[1]: Entering directory `/root/atmelwlandriver/src/usb'
for i in rfmd; do make $i || exit 1; done
make[2]: Entering directory `/root/atmelwlandriver/src/usb'
make final CFLAGS:='-D__KERNEL__ -O2 -fno-strict-aliasing -fomit-frame-pointer -pipe -I/lib/modules/2.4.20-8/build/include -I/root/atmelwlandriver/src/includes -I/root/atmelwlandriver/src/includes/usb -Wall -DRFMD' MODULE:='usbvnetr.o'
make[3]: Entering directory `/root/atmelwlandriver/src/usb'
gcc -D__KERNEL__ -O2 -fno-strict-aliasing -fomit-frame-pointer -pipe -I/lib/modules/2.4.20-8/build/include -I/root/atmelwlandriver/src/includes -I/root/atmelwlandriver/src/includes/usb -Wall -DRFMD -DMODULE -c vnetusba.c
vnetusba.c: In function `usb_vnet_ioctl':
vnetusba.c:706: structure has no member named `PairwiseCipherSuite'
vnetusba.c:706: `CIPHER_SUITE_WEP_128' undeclared (first use in this function)
vnetusba.c:706: (Each undeclared identifier is reported only once
vnetusba.c:706: for each function it appears in.)
make[3]: *** [vnetusba.o] Error 1
make[3]: Leaving directory `/root/atmelwlandriver/src/usb'
make[2]: *** [rfmd] Error 2
make[2]: Leaving directory `/root/atmelwlandriver/src/usb'
make[1]: *** [all] Error 1
make[1]: Leaving directory `/root/atmelwlandriver/src/usb'
make: *** [all] Error 1


Can anyone tell me what are those messages and how can I fix the error problem?
Thanks!
 
  


Reply


Thread Tools Search this Thread
Search this Thread:

Advanced Search

Posting Rules
You may not post new threads
You may not post replies
You may not post attachments
You may not edit your posts

BB code is On
Smilies are On
[IMG] code is Off
HTML code is Off


Similar Threads
Thread Thread Starter Forum Replies Last Post
bash script: using "select" to show multi-word options? (like "option 1"/"o zidane_tribal Programming 6 03-21-2013 11:35 AM
error running "make" and "arkollonrc"... Toro Linux - Software 1 04-19-2004 01:24 AM
Boot messages not the same as "dmesg" or "/var/log/messages"? massai Linux - General 5 03-10-2004 01:18 AM
help with "make" error "Missing seperator" hrishikesh Linux - Software 1 07-18-2003 02:40 AM
LFS 4.1: Stalled at Perl, "missing seperator" error from "make" SparceMatrix Linux From Scratch 1 06-07-2003 04:31 PM


All times are GMT -5. The time now is 11:17 AM.

Main Menu
Advertisement
My LQ
Write for LQ
LinuxQuestions.org is looking for people interested in writing Editorials, Articles, Reviews, and more. If you'd like to contribute content, let us know.
Main Menu
Syndicate
RSS1  Latest Threads
RSS1  LQ News
Twitter: @linuxquestions
identi.ca: @linuxquestions
Facebook: linuxquestions Google+: linuxquestions
Open Source Consulting | Domain Registration