LinuxQuestions.org

LinuxQuestions.org (/questions/)
-   Linux - Hardware (http://www.linuxquestions.org/questions/linux-hardware-18/)
-   -   suse 10.1 x86-64: installation of nvidia drivers for onboard nForce 430 failed... (http://www.linuxquestions.org/questions/linux-hardware-18/suse-10-1-x86-64-installation-of-nvidia-drivers-for-onboard-nforce-430-failed-475081/)

jojolx 08-18-2006 07:37 AM

suse 10.1 x86-64: installation of nvidia drivers for onboard nForce 430 failed...
 
Hi,

My PC:
MSI MB k8ngm2-fid (onboard nvidia graphics Geforce 6150 + network/sound nForce 430), AMD 3000+, 939 socket, ...
linux distro: suse 10.1 x86-64

Question:
Installation of Geforce 6150 driver was OK,
but installation of nvidia drivers for nForce 430 failed, log follows...

I used the following driver for nForce 430:
//download.nvidia.com/XFree86/nforce/1.0-0310/NFORCE-Linux-x86_64-1.0-0310-pkg1.run

Can anybody help me to solve this problem?

Thanks a lot,

J.

nforce-installer log file '/var/log/nvidia-nforce-installer.log'
creation time: Thu Aug 17 22:57:16 2006

option status:
license pre-accepted : false
expert : false
uninstall : false
driver info : false
no precompiled interface : false
no ncurses color : false
no questions : false
silent : false
Installer install prefix : /usr
kernel source path : (not specified)
net kernel install path : (not specified)
audio kernel install path : (not specified)
proc mount point : /proc
ui : (not specified)
tmpdir : /tmp

Using: nvidia-installer ncurses user interface
-> Found package NVIDIA audio driver for Linux-x86_64
-> Found package NVIDIA network driver for Linux-x86_64
-> Please select packages for installation:
Selections:
NVIDIA audio driver for Linux-x86_64 (1.0-7)
NVIDIA network driver for Linux-x86_64 (1.0-13)
-> Starting install of NVIDIA audio driver for Linux-x86_64
-> Checking for loaded module nvsound
-> Checking for loaded module nvaudio
-> License accepted.
-> Skipping check for conflicting rpms.
-> /proc/version is Linux version 2.6.16.13-4-default (geeko@buildhost) (gcc
version 4.1.0 (SUSE Linux)) #1 Wed May 3 04:53:23 UTC 2006
-> No precompiled kernel interface was found to match your kernel; this means
that the installer will need to compile a new kernel interface.
-> Kernel source path: '/lib/modules/2.6.16.13-4-default/source'
-> Kernel output path: '/lib/modules/2.6.16.13-4-default/build'
-> Performing cc_version_check with CC="cc".
-> running command /usr/bin/grep "^PATCHLEVEL ="
/lib/modules/2.6.16.13-4-default/source/Makefile | /usr/bin/cut -d " " -f 3
-> Kernel module filename is nvsound.ko
Cleaning kernel module build directory.
executing: 'cd ./nvsound/main; make clean'...
rm -f *.ko *mod.* *.cmd nv*.o *~ core
-> Building kernel module:
executing: 'cd ./nvsound/main; make module SYSSRC=/lib/modules/2.6.16.13-4-d
efault/source SYSOUT=/lib/modules/2.6.16.13-4-default/build'...
make -C /lib/modules/2.6.16.13-4-default/build \
KBUILD_SRC=/usr/src/linux-2.6.16.13-4 \
KBUILD_EXTMOD="/tmp/selfgz9899/NFORCE-Linux-x86_64-1.0-0310-pkg1/nvsound/mai
n" -f /usr/src/linux-2.6.16.13-4/Makefile modules
rm -rf /tmp/selfgz9899/NFORCE-Linux-x86_64-1.0-0310-pkg1/nvsound/main/.tmp_v
ersions
mkdir -p /tmp/selfgz9899/NFORCE-Linux-x86_64-1.0-0310-pkg1/nvsound/main/.tmp
_versions
make -f /usr/src/linux-2.6.16.13-4/scripts/Makefile.build obj=/tmp/selfgz989
9/NFORCE-Linux-x86_64-1.0-0310-pkg1/nvsound/main
cc -Wp,-MD,/tmp/selfgz9899/NFORCE-Linux-x86_64-1.0-0310-pkg1/nvsound/main/
.nvalinux.o.d -nostdinc -isystem /usr/lib64/gcc/x86_64-suse-linux/4.1.0/inc
lude -D__KERNEL__ -Iinclude -Iinclude2 -I/usr/src/linux-2.6.16.13-4/include
-include /usr/src/linux-2.6.16.13-4-obj/x86_64/default/include/linux/autocon
f.h -I/tmp/selfgz9899/NFORCE-Linux-x86_64-1.0-0310-pkg1/nvsound/main -Wall
-Wundef -Wstrict-prototypes -Wno-trigraphs -Werror-implicit-function-declara
tion -fno-strict-aliasing -fno-common -ffreestanding -Os
-fomit-frame-pointer -mtune=generic -m64 -mno-red-zone -mcmodel=kernel -pip
e -fno-reorder-blocks -Wno-sign-compare -fno-asynchronous-unwind-tables -fun
it-at-a-time -mno-sse -mno-mmx -mno-sse2 -mno-3dnow -Wdeclaration-after-stat
ement -Wno-pointer-sign -I/tmp/selfgz9899/NFORCE-Linux-x86_64-1.0-0310-pkg1/
nvsound/main -Wall -Wimplicit -Wreturn-type -Wswitch -Wformat -Wchar-subscr
ipts -Wparentheses -Wpointer-arith -Wno-multichar -Werror -O -MD -Wno-cast-q
ual -Wno-error -DNV_CHANGE_PAGE_ATTR_PRESENT -DMODULE -D"KBUILD_STR(s)=#s" -
D"KBUILD_BASENAME=KBUILD_STR(nvalinux)" -D"KBUILD_MODNAME=KBUILD_STR(nvsoun
d)" -c -o /tmp/selfgz9899/NFORCE-Linux-x86_64-1.0-0310-pkg1/nvsound/main/.tm
p_nvalinux.o /tmp/selfgz9899/NFORCE-Linux-x86_64-1.0-0310-pkg1/nvsound/main/
nvalinux.c
In file included from /usr/src/linux-2.6.16.13-4/include/linux/list.h:7,
from /usr/src/linux-2.6.16.13-4/include/linux/wait.h:23,
from include2/asm/semaphore.h:42,
from /usr/src/linux-2.6.16.13-4/include/linux/sched.h:20,
from /usr/src/linux-2.6.16.13-4/include/linux/module.h:10,
from /tmp/selfgz9899/NFORCE-Linux-x86_64-1.0-0310-pkg1/nvso
und/main/nvalinux.c:19:
/usr/src/linux-2.6.16.13-4/include/linux/prefetch.h: In function ‘prefetch
_range’:
/usr/src/linux-2.6.16.13-4/include/linux/prefetch.h:62: warning: pointer of
type ‘void *’ used in arithmetic
In file included from include2/asm/elf.h:11,
from /usr/src/linux-2.6.16.13-4/include/linux/elf.h:6,
from /usr/src/linux-2.6.16.13-4/include/linux/module.h:17,
from /tmp/selfgz9899/NFORCE-Linux-x86_64-1.0-0310-pkg1/nvso
und/main/nvalinux.c:19:
include2/asm/compat.h: In function ‘compat_alloc_user_space’:
include2/asm/compat.h:202: warning: pointer of type ‘void *’ used in ari
thmetic
In file included from /tmp/selfgz9899/NFORCE-Linux-x86_64-1.0-0310-pkg1/nvso
und/main/nvalinux.c:25:
include2/asm/io.h: In function ‘check_signature’:
include2/asm/io.h:308: warning: wrong type argument to increment
In file included from include2/asm/pci.h:93,
from /usr/src/linux-2.6.16.13-4/include/linux/pci.h:684,
from /tmp/selfgz9899/NFORCE-Linux-x86_64-1.0-0310-pkg1/nvso
und/main/nvalinux.c:29:
/usr/src/linux-2.6.16.13-4/include/asm-generic/pci-dma-compat.h: In function
‘pci_map_page’:
/usr/src/linux-2.6.16.13-4/include/asm-generic/pci-dma-compat.h:49: warning:
pointer of type ‘void *’ used in arithmetic
/tmp/selfgz9899/NFORCE-Linux-x86_64-1.0-0310-pkg1/nvsound/main/nvalinux.c: I
n function ‘AosMemoryPhysicalAddressListGet’:
/tmp/selfgz9899/NFORCE-Linux-x86_64-1.0-0310-pkg1/nvsound/main/nvalinux.c:71
0: warning: unused variable ‘phys_addr’
/tmp/selfgz9899/NFORCE-Linux-x86_64-1.0-0310-pkg1/nvsound/main/nvalinux.c: A
t top level:
/tmp/selfgz9899/NFORCE-Linux-x86_64-1.0-0310-pkg1/nvsound/main/nvavm.h:208:
warning: ‘nv_flush_caches’ defined but not used
cc -Wp,-MD,/tmp/selfgz9899/NFORCE-Linux-x86_64-1.0-0310-pkg1/nvsound/main/
.nvmixer.o.d -nostdinc -isystem /usr/lib64/gcc/x86_64-suse-linux/4.1.0/incl
ude -D__KERNEL__ -Iinclude -Iinclude2 -I/usr/src/linux-2.6.16.13-4/include -
include /usr/src/linux-2.6.16.13-4-obj/x86_64/default/include/linux/autoconf
.h -I/tmp/selfgz9899/NFORCE-Linux-x86_64-1.0-0310-pkg1/nvsound/main -Wall
-Wundef -Wstrict-prototypes -Wno-trigraphs -Werror-implicit-function-declara
tion -fno-strict-aliasing -fno-common -ffreestanding -Os -fomit-frame-pointe
r -mtune=generic -m64 -mno-red-zone -mcmodel=kernel -pipe -fno-reorder-block
s -Wno-sign-compare -fno-asynchronous-unwind-tables -funit-at-a-time -mno-ss
e -mno-mmx -mno-sse2 -mno-3dnow -Wdeclaration-after-statement -Wno-pointer-s
ign -I/tmp/selfgz9899/NFORCE-Linux-x86_64-1.0-0310-pkg1/nvsound/main -Wall
-Wimplicit -Wreturn-type -Wswitch -Wformat -Wchar-subscripts -Wparentheses -
Wpointer-arith -Wno-multichar -Werror -O -MD -Wno-cast-qual -Wno-error -DNV_
CHANGE_PAGE_ATTR_PRESENT -DMODULE -D"KBUILD_STR(s)=#s" -D"KBUILD_BASENAME=KB
UILD_STR(nvmixer)" -D"KBUILD_MODNAME=KBUILD_S
TR(nvsound)" -c -o /tmp/selfgz9899/NFORCE-Linux-x86_64-1.0-0310-pkg1/nvsound
/main/.tmp_nvmixer.o /tmp/selfgz9899/NFORCE-Linux-x86_64-1.0-0310-pkg1/nvsou
nd/main/nvmixer.c
In file included from /usr/src/linux-2.6.16.13-4/include/linux/list.h:7,
from /usr/src/linux-2.6.16.13-4/include/linux/wait.h:23,
from include2/asm/semaphore.h:42,
from /usr/src/linux-2.6.16.13-4/include/linux/sched.h:20,
from /tmp/selfgz9899/NFORCE-Linux-x86_64-1.0-0310-pkg1/nvso
und/main/nvhw.h:29,
from /tmp/selfgz9899/NFORCE-Linux-x86_64-1.0-0310-pkg1/nvso
und/main/nvmixer.c:14:
/usr/src/linux-2.6.16.13-4/include/linux/prefetch.h: In function ‘prefetch
_range’:
/usr/src/linux-2.6.16.13-4/include/linux/prefetch.h:62: warning: pointer of
type ‘void *’ used in arithmetic
In file included from include2/asm/elf.h:11,
from /usr/src/linux-2.6.16.13-4/include/linux/elf.h:6,
from /usr/src/linux-2.6.16.13-4/include/linux/module.h:17,
from /usr/src/linux-2.6.16.13-4/include/linux/device.h:20,
from /usr/src/linux-2.6.16.13-4/include/linux/pci.h:54,
from /tmp/selfgz9899/NFORCE-Linux-x86_64-1.0-0310-pkg1/nvso
und/main/nvhw.h:35,
from /tmp/selfgz9899/NFORCE-Linux-x86_64-1.0-0310-pkg1/nvso
und/main/nvmixer.c:14:
include2/asm/compat.h: In function ‘compat_alloc_user_space’:
include2/asm/compat.h:202: warning: pointer of type ‘void *’ used in ari
thmetic
In file included from /usr/src/linux-2.6.16.13-4/include/linux/dmapool.h:14,
from /usr/src/linux-2.6.16.13-4/include/linux/pci.h:558,
from /tmp/selfgz9899/NFORCE-Linux-x86_64-1.0-0310-pkg1/nvso
und/main/nvhw.h:35,
from /tmp/selfgz9899/NFORCE-Linux-x86_64-1.0-0310-pkg1/nvso
und/main/nvmixer.c:14:
include2/asm/io.h: In function ‘check_signature’:
include2/asm/io.h:308: warning: wrong type argument to increment
In file included from include2/asm/pci.h:93,
from /usr/src/linux-2.6.16.13-4/include/linux/pci.h:684,
from /tmp/selfgz9899/NFORCE-Linux-x86_64-1.0-0310-pkg1/nvso
und/main/nvhw.h:35,
from /tmp/selfgz9899/NFORCE-Linux-x86_64-1.0-0310-pkg1/nvso
und/main/nvmixer.c:14:
/usr/src/linux-2.6.16.13-4/include/asm-generic/pci-dma-compat.h: In function
‘pci_map_page’:
/usr/src/linux-2.6.16.13-4/include/asm-generic/pci-dma-compat.h:49: warning:
pointer of type ‘void *’ used in arithmetic
cc -Wp,-MD,/tmp/selfgz9899/NFORCE-Linux-x86_64-1.0-0310-pkg1/nvsound/main/
.nvmain.o.d -nostdinc -isystem /usr/lib64/gcc/x86_64-suse-linux/4.1.0/inclu
de -D__KERNEL__ -Iinclude -Iinclude2 -I/usr/src/linux-2.6.16.13-4/include -i
nclude /usr/src/linux-2.6.16.13-4-obj/x86_64/default/include/linux/autoconf.
h -I/tmp/selfgz9899/NFORCE-Linux-x86_64-1.0-0310-pkg1/nvsound/main -Wall -
Wundef -Wstrict-prototypes -Wno-trigraphs -Werror-implicit-function-declarat
ion -fno-strict-aliasing -fno-common -ffreestanding -Os -fomit-frame-pointer
-mtune=generi
c -m64 -mno-red-zone -mcmodel=kernel -pipe -fno-reorder-blocks -Wno-sign-com
pare -fno-asynchronous-unwind-tables -funit-at-a-time -mno-sse -mno-mmx -mno
-sse2 -mno-3dnow -Wdeclaration-after-statement -Wno-pointer-sign -I/tmp/self
gz9899/NFORCE-Linux-x86_64-1.0-0310-pkg1/nvsound/main -Wall -Wimplicit -Wre
turn-type -Wswitch -Wformat -Wchar-subscripts -Wparentheses -Wpointer-arith
-Wno-multichar -Werror -O -MD -Wno-cast-qual -Wno-error -DNV_CHANGE_PAGE_ATT
R_PRESENT -DMODULE -D"KBUILD_STR(s)=#s" -D"KBUILD_BASENAME=KBUILD_STR(nvmain
)" -D"KBUILD_MODNAME=KBUILD_STR(nvsound)" -c -o /tmp/selfgz9899/NFORCE-Linu
x-x86_64-1.0-0310-pkg1/nvsound/main/.tmp_nvmain.o /tmp/selfgz9899/NFORCE-Lin
ux-x86_64-1.0-0310-pkg1/nvsound/main/nvmain.c
In file included from /usr/src/linux-2.6.16.13-4/include/linux/list.h:7,
from /usr/src/linux-2.6.16.13-4/include/linux/wait.h:23,
from include2/asm/semaphore.h:42,
from /usr/src/linux-2.6.16.13-4/include/linux/sched.h:20,
from /usr/src/linux-2.6.16.13-4/include/linux/module.h:10,
from /tmp/selfgz9899/NFORCE-Linux-x86_64-1.0-0310-pkg1/nvso
und/main/nvmain.c:27:
/usr/src/linux-2.6.16.13-4/include/linux/prefetch.h: In function ‘prefetch
_range’:
/usr/src/linux-2.6.16.13-4/include/linux/prefetch.h:62: warning: pointer of
type ‘void *’ used in arithmetic
In file included from include2/asm/elf.h:11,
from /usr/src/linux-2.6.16.13-4/include/linux/elf.h:6,
from /usr/src/linux-2.6.16.13-4/include/linux/module.h:17,
from /tmp/selfgz9899/NFORCE-Linux-x86_64-1.0-0310-pkg1/nvso
und/main/nvmain.c:27:
include2/asm/compat.h: In function ‘compat_alloc_user_space’:
include2/asm/compat.h:202: warning: pointer of type ‘void *’ used in ari
thmetic
In file included from /usr/src/linux-2.6.16.13-4/include/linux/dmapool.h:14,
from /usr/src/linux-2.6.16.13-4/include/linux/pci.h:558,
from /tmp/selfgz9899/NFORCE-Linux-x86_64-1.0-0310-pkg1/nvso
und/main/nvhw.h:35,
from /tmp/selfgz9899/NFORCE-Linux-x86_64-1.0-0310-pkg1/nvso
und/main/nvmain.c:29:
include2/asm/io.h: In function ‘check_signature’:
include2/asm/io.h:308: warning: wrong type argument to increment
In file included from include2/asm/pci.h:93,
from /usr/src/linux-2.6.16.13-4/include/linux/pci.h:684,
from /tmp/selfgz9899/NFORCE-Linux-x86_64-1.0-0310-pkg1/nvso
und/main/nvhw.h:35,
from /tmp/selfgz9899/NFORCE-Linux-x86_64-1.0-0310-pkg1/nvso
und/main/nvmain.c:29:
/usr/src/linux-2.6.16.13-4/include/asm-generic/pci-dma-compat.h: In function
‘pci_map_page’:
/usr/src/linux-2.6.16.13-4/include/asm-generic/pci-dma-compat.h:49: warning:
pointer of type ‘void *’ used in arithmetic
/tmp/selfgz9899/NFORCE-Linux-x86_64-1.0-0310-pkg1/nvsound/main/nvmain.c: In
function ‘Nvaudio_mmap’:
/tmp/selfgz9899/NFORCE-Linux-x86_64-1.0-0310-pkg1/nvsound/main/nvmain.c:991:
error: implicit declaration of function ‘remap_page_range’
/tmp/selfgz9899/NFORCE-Linux-x86_64-1.0-0310-pkg1/nvsound/main/nvmain.c: At
top level:
/tmp/selfgz9899/NFORCE-Linux-x86_64-1.0-0310-pkg1/nvsound/main/nvmain.c:2191
: error: expected ‘)’ before string constant
make[4]: *** [/tmp/selfgz9899/NFORCE-Linux-x86_64-1.0-0310-pkg1/nvsound/main
/nvmain.o] Error 1
make[3]: *** [_module_/tmp/selfgz9899/NFORCE-Linux-x86_64-1.0-0310-pkg1/nvso
und/main] Error 2
make[2]: *** [modules] Error 2
-> Error.
ERROR: The NVIDIA kernel module was not created.
ERROR: Installation of the audio driver has failed. Please see the file
'/var/log/nvidia-nforce-installer.log' for details. You may find
suggestions on fixing installation problems in the README available on
the Linux driver download page at nvidia.com.
-> Starting install of NVIDIA network driver for Linux-x86_64
-> Checking for loaded module nvnet
-> Checking for loaded module forcedeth
-> License accepted.
-> Skipping check for conflicting rpms.
-> /proc/version is Linux version 2.6.16.13-4-default (geeko@buildhost) (gcc
version 4.1.0 (SUSE Linux)) #1 Wed May 3 04:53:23 UTC 2006
-> No precompiled kernel interface was found to match your kernel; this means
that the installer will need to compile a new kernel interface.
-> Using the kernel source path '/lib/modules/2.6.16.13-4-default/source' as
specified by the '--kernel-source-path' commandline option.
-> Kernel source path: '/lib/modules/2.6.16.13-4-default/source'
-> Using the kernel output path '/lib/modules/2.6.16.13-4-default/build' as
specified by the '--kernel-output-path' commandline option.
-> Kernel output path: '/lib/modules/2.6.16.13-4-default/build'
-> Performing cc_version_check with CC="cc".
-> running command /usr/bin/grep "^PATCHLEVEL ="
/lib/modules/2.6.16.13-4-default/source/Makefile | /usr/bin/cut -d " " -f 3
-> Kernel module filename is nvnet.ko
Cleaning kernel module build directory.
executing: 'cd ./nvnet; make clean'...
rm -f *.ko *mod.* *.cmd nvenet.o nvenetif.o nvnet.o *~ core
-> Building kernel module:
executing: 'cd ./nvnet; make module SYSSRC=/lib/modules/2.6.16.13-4-default/
source SYSOUT=/lib/modules/2.6.16.13-4-default/build'...
make -C /lib/modules/2.6.16.13-4-default/build \
KBUILD_SRC=/usr/src/linux-2.6.16.13-4 \
KBUILD_EXTMOD="/tmp/selfgz9899/NFORCE-Linux-x86_64-1.0-0310-pkg1/nvnet" -f /
usr/src/linux-2.6.16.13-4/Makefile modules
rm -rf /tmp/selfgz9899/NFORCE-Linux-x86_64-1.0-0310-pkg1/nvnet/.tmp_versions
mkdir -p /tmp/selfgz9899/NFORCE-Linux-x86_64-1.0-0310-pkg1/nvnet/.tmp_versio
ns
make -f /usr/src/linux-2.6.16.13-4/scripts/Makefile.build obj=/tmp/selfgz989
9/NFORCE-Linux-x86_64-1.0-0310-pkg1/nvnet
cc -Wp,-MD,/tmp/selfgz9899/NFORCE-Linux-x86_64-1.0-0310-pkg1/nvnet/.nvenet
.o.d -nostdinc -isystem /usr/lib64/gcc/x86_64-suse-linux/4.1.0/include -D__
KERNEL__ -Iinclude -Iinclude2 -I/usr/src/linux-2.6.16.13-4/include -include
/usr/src/linux-2.6.16.13-4-obj/x86_64/default/include/linux/autoconf.h -I/t
mp/selfgz9899/NFORCE-Linux-x86_64-1.0-0310-pkg1/nvnet -Wall -Wundef -Wstric
t-prototypes -Wno-trigraphs -Werror-implicit-function-declaration -fno-stric
t-aliasing -fno-common -ffreestanding -Os -fomit-frame-pointer -mtune=generi
c -m64 -m
no-red-zone -mcmodel=kernel -pipe -fno-reorder-blocks -Wno-sign-compare -fno
-asynchronous-unwind-tables -funit-at-a-time -mno-sse -mno-mmx -mno-sse2 -mn
o-3dnow -Wdeclaration-after-statement -Wno-pointer-sign -DDRIVERVER=\"9999\"
-I/tmp/selfgz9899/NFORCE-Linux-x86_64-1.0-0310-pkg1/nvnet -Wall -Wimplicit
-Wreturn-type -Wswitch -Wformat -Wchar-subscripts -Wparentheses -Wpointer-ar
ith -Wno-multichar -Werror -O -MD -Wno-cast-qual -Wno-error -DMODULE -D"KBUI
LD_STR(s)=#s" -D"KBUILD_BASENAME=KBUILD_STR(nvenet)" -D"KBUILD_MODNAME=KBUI
LD_STR(nvnet)" -c -o /tmp/selfgz9899/NFORCE-Linux-x86_64-1.0-0310-pkg1/nvnet
/.tmp_nvenet.o /tmp/selfgz9899/NFORCE-Linux-x86_64-1.0-0310-pkg1/nvnet/nvene
t.c
In file included from /usr/src/linux-2.6.16.13-4/include/linux/list.h:7,
from /usr/src/linux-2.6.16.13-4/include/linux/wait.h:23,
from include2/asm/semaphore.h:42,
from /usr/src/linux-2.6.16.13-4/include/linux/sched.h:20,
from /usr/src/linux-2.6.16.13-4/include/linux/module.h:10,
from /tmp/selfgz9899/NFORCE-Linux-x86_64-1.0-0310-pkg1/nvne
t/nvenet.h:20,
from /tmp/selfgz9899/NFORCE-Linux-x86_64-1.0-0310-pkg1/nvne
t/nvenet.c:22:
/usr/src/linux-2.6.16.13-4/include/linux/prefetch.h: In function ‘prefetch
_range’:
/usr/src/linux-2.6.16.13-4/include/linux/prefetch.h:62: warning: pointer of
type ‘void *’ used in arithmetic
In file included from include2/asm/elf.h:11,
from /usr/src/linux-2.6.16.13-4/include/linux/elf.h:6,
from /usr/src/linux-2.6.16.13-4/include/linux/module.h:17,
from /tmp/selfgz9899/NFORCE-Linux-x86_64-1.0-0310-pkg1/nvne
t/nvenet.h:20,
from /tmp/selfgz9899/NFORCE-Linux-x86_64-1.0-0310-pkg1/nvne
t/nvenet.c:22:
include2/asm/compat.h: In function ‘compat_alloc_user_space’:
include2/asm/compat.h:202: warning: pointer of type ‘void *’ used in ari
thmetic
In file included from /usr/src/linux-2.6.16.13-4/include/linux/dmapool.h:14,
from /usr/src/linux-2.6.16.13-4/include/linux/pci.h:558,
from /tmp/selfgz9899/NFORCE-Linux-x86_64-1.0-0310-pkg1/nvne
t/nvenet.h:32,
from /tmp/selfgz9899/NFORCE-Linux-x86_64-1.0-0310-pkg1/nvne
t/nvenet.c:22:
include2/asm/io.h: In function ‘check_signature’:
include2/asm/io.h:308: warning: wrong type argument to increment
In file included from include2/asm/pci.h:93,
from /usr/src/linux-2.6.16.13-4/include/linux/pci.h:684,
from /tmp/selfgz9899/NFORCE-Linux-x86_64-1.0-0310-pkg1/nvne
t/nvenet.h:32,
from /tmp/selfgz9899/NFORCE-Linux-x86_64-1.0-0310-pkg1/nvne
t/nvenet.c:22:
/usr/src/linux-2.6.16.13-4/include/asm-generic/pci-dma-compat.h: In function
‘pci_map_page’:
/usr/src/linux-2.6.16.13-4/include/asm-generic/pci-dma-compat.h:49: warning:
pointer of type ‘void *’ used in arithmetic
/tmp/selfgz9899/NFORCE-Linux-x86_64-1.0-0310-pkg1/nvnet/nvenet.c: At top lev
el:
/tmp/selfgz9899/NFORCE-Linux-x86_64-1.0-0310-pkg1/nvnet/nvenet.c:217: error:
expected ‘)’ before string constant
/tmp/selfgz9899/NFORCE-Linux-x86_64-1.0-0310-pkg1/nvnet/nvenet.c:220: error:
expected ‘)’ before string constant
/tmp/selfgz9899/NFORCE-Linux-x86_64-1.0-0310-pkg1/nvnet/nvenet.c:223: error:
expected ‘)’ before string constant
/tmp/selfgz9899/NFORCE-Linux-x86_64-1.0-0310-pkg1/nvnet/nvenet.c:226: error:
expected ‘)’ before string constant
/tmp/selfgz9899/NFORCE-Linux-x86_64-1.0-0310-pkg1/nvnet/nvenet.c:229: error:
expected ‘)’ before string constant
/tmp/selfgz9899/NFORCE-Linux-x86_64-1.0-0310-pkg1/nvnet/nvenet.c:232: error:
expected ‘)’ before string constant
/tmp/selfgz9899/NFORCE-Linux-x86_64-1.0-0310-pkg1/nvnet/nvenet.c:235: error:
expected ‘)’ before string constant
/tmp/selfgz9899/NFORCE-Linux-x86_64-1.0-0310-pkg1/nvnet/nvenet.c:238: error:
expected ‘)’ before string constant
/tmp/selfgz9899/NFORCE-Linux-x86_64-1.0-0310-pkg1/nvnet/nvenet.c:241: error:
expected ‘)’ before string constant
/tmp/selfgz9899/NFORCE-Linux-x86_64-1.0-0310-pkg1/nvnet/nvenet.c:244: error:
expected ‘)’ before string constant
/tmp/selfgz9899/NFORCE-Linux-x86_64-1.0-0310-pkg1/nvnet/nvenet.c:247: error:
expected ‘)’ before string constant
/tmp/selfgz9899/NFORCE-Linux-x86_64-1.0-0310-pkg1/nvnet/nvenet.c:250: error:
expected ‘)’ before string constant
/tmp/selfgz9899/NFORCE-Linux-x86_64-1.0-0310-pkg1/nvnet/nvenet.c:336: warnin
g: initialization from incompatible pointer type
make[4]: *** [/tmp/selfgz9899/NFORCE-Linux-x86_64-1.0-0310-pkg1/nvnet/nvenet
.o] Error 1
make[3]: *** [_module_/tmp/selfgz9899/NFORCE-Linux-x86_64-1.0-0310-pkg1/nvne
t] Error 2
make[2]: *** [modules] Error 2
-> Error.
ERROR: The NVIDIA kernel module was not created.
ERROR: Installation of the network driver has failed. Please see the file
'/var/log/nvidia-nforce-installer.log' for details. You may find
suggestions on fixing installation problems in the README available on
the Linux driver download page at nvidia.com.


All times are GMT -5. The time now is 05:46 AM.