LinuxQuestions.org
Visit Jeremy's Blog.
Go Back   LinuxQuestions.org > Forums > Linux Forums > Linux - General
User Name
Password
Linux - General This Linux forum is for general Linux questions and discussion.
If it is Linux Related and doesn't seem to fit in any other forum then this is the place.

Notices

Reply
 
Search this Thread
Old 11-06-2004, 01:25 PM   #1
burn0ut
LQ Newbie
 
Registered: May 2004
Posts: 18

Rep: Reputation: 0
Question Kernel 2.6.9 compile error


I wanted to test the new 2.6.9-rc4 kernel with my Ubuntu install. So I downloaded the sources and I made it ready for install. Copyed the .config and so on...
When I try to compile the kernel, I get these faults:
Code:
sudo make
  CHK     include/linux/version.h
make[1]: `arch/i386/kernel/asm-offsets.s' is up to date.
  CHK     include/linux/compile.h
  CC [M]  drivers/char/drm/gamma_drv.o
In file included from drivers/char/drm/gamma_drv.c:42:
drivers/char/drm/gamma_context.h: In function `gamma_context_switch_complete':
drivers/char/drm/gamma_context.h:193: error: structure has no member named `next_buffer'
drivers/char/drm/gamma_context.h:193: error: structure has no member named `next_buffer'
In file included from drivers/char/drm/gamma_drv.c:44:
drivers/char/drm/gamma_old_dma.h: In function `gamma_clear_next_buffer':
drivers/char/drm/gamma_old_dma.h:40: error: structure has no member named `next_buffer'
drivers/char/drm/gamma_old_dma.h:41: error: structure has no member named `next_queue'
drivers/char/drm/gamma_old_dma.h:41: error: structure has no member named `next_queue'
drivers/char/drm/gamma_old_dma.h:41: error: structure has no member named `next_queue'
drivers/char/drm/gamma_old_dma.h:41: error: structure has no member named `next_queue'
drivers/char/drm/gamma_old_dma.h:41: error: structure has no member named `next_queue'
drivers/char/drm/gamma_old_dma.h:41: error: structure has no member named `next_queue'
drivers/char/drm/gamma_old_dma.h:42: error: structure has no member named `next_queue'
drivers/char/drm/gamma_old_dma.h:44: error: structure has no member named `next_queue'
In file included from drivers/char/drm/gamma_drv.c:46:
drivers/char/drm/drm_drv.h: In function `gamma_release':
drivers/char/drm/drm_drv.h:808: let op: implicit declaration of function `gamma_ctxbitmap_free'
make[3]: *** [drivers/char/drm/gamma_drv.o] Fout 1
make[2]: *** [drivers/char/drm] Fout 2
make[1]: *** [drivers/char] Fout 2
make: *** [drivers] Fout 2
Somebody got an id to solve this problem?

(If these thread is in the wrong forum, plz move than, thx)
 
Old 11-06-2004, 01:46 PM   #2
Crashed_Again
Senior Member
 
Registered: Dec 2002
Location: Atlantic City, NJ
Distribution: Ubuntu & Arch
Posts: 3,503

Rep: Reputation: 57
Its a known issue. You probably have it selected in your old config file. Just run make config, exit, and save it and it should disable gamma drm since its marked broken.
 
Old 11-06-2004, 02:58 PM   #3
burn0ut
LQ Newbie
 
Registered: May 2004
Posts: 18

Original Poster
Rep: Reputation: 0
Yep, indeed, I copied the .config from the older ubuntu kernel into the new 2.6.9 kernel folder.
Do I just have to set the DRI_GAMMA to N ?

Last edited by burn0ut; 11-06-2004 at 03:36 PM.
 
Old 12-08-2004, 08:05 AM   #4
nic777
LQ Newbie
 
Registered: Dec 2003
Posts: 23

Rep: Reputation: 15
Hi,

I have exactly the same problem (although I'm using the final release candidate of 2.6.9?). I can't find a DRI GAMMA option in menuconfig - did you find out how to change this setting?

Thanks
Nick
 
  


Reply


Thread Tools Search this Thread
Search this Thread:

Advanced Search

Posting Rules
You may not post new threads
You may not post replies
You may not post attachments
You may not edit your posts

BB code is On
Smilies are On
[IMG] code is On
HTML code is Off


Similar Threads
Thread Thread Starter Forum Replies Last Post
Kernel Compile error JTR Debian 2 08-03-2005 12:54 PM
Compile kernel 2.6.11-2 error subaruwrx Debian 2 03-10-2005 01:10 AM
Kernel compile error theMagus Fedora 2 05-31-2004 03:09 PM
kernel 2.4.24 compile error german Linux - Software 6 01-30-2004 06:31 PM
Compile kernel error Lokii13 Linux - Newbie 1 02-26-2003 05:26 PM


All times are GMT -5. The time now is 05:20 PM.

Main Menu
My LQ
Write for LQ
LinuxQuestions.org is looking for people interested in writing Editorials, Articles, Reviews, and more. If you'd like to contribute content, let us know.
Main Menu
Syndicate
RSS1  Latest Threads
RSS1  LQ News
Twitter: @linuxquestions
identi.ca: @linuxquestions
Facebook: linuxquestions Google+: linuxquestions
Open Source Consulting | Domain Registration