LinuxQuestions.org
Support LQ: Use code LQ3 and save $3 on Domain Registration
Go Back   LinuxQuestions.org > Forums > Linux Forums > Linux - Software > Linux - Games
User Name
Password
Linux - Games This forum is for all discussion relating to gaming in Linux.

Notices

Reply
 
Search this Thread
Old 11-21-2005, 07:25 PM   #1
slithy
Member
 
Registered: Jun 2005
Distribution: Debian "Etch"
Posts: 48

Rep: Reputation: 15
Stepmania 3.9-rc3 emerge fails


I am running Gentoo 2005.1 ~x86 and when I try to emerge Stepmania 3.9-rc3, it fails with the error

Code:
arch/MovieTexture/MovieTexture_FFMpeg.cpp: In member function `int 
   FFMpeg_Helper::DecodePacket()':
arch/MovieTexture/MovieTexture_FFMpeg.cpp:331: error: cannot convert `
   avcodec::AVCodecContext**' to `avcodec::AVCodecContext*' for argument `1' to 
   `int avcodec::avcodec_decode_video(avcodec::AVCodecContext*, 
   avcodec::AVFrame*, int*, uint8_t*, int)'
arch/MovieTexture/MovieTexture_FFMpeg.cpp:363: error: request for member `
   frame_rate_base' in `this->FFMpeg_Helper::m_stream->avcodec::AVStream::codec
   ', which is of non-class type `avcodec::AVCodecContext*'
arch/MovieTexture/MovieTexture_FFMpeg.cpp:363: error: request for member `
   frame_rate' in `this->FFMpeg_Helper::m_stream->avcodec::AVStream::codec', 
   which is of non-class type `avcodec::AVCodecContext*'
arch/MovieTexture/MovieTexture_FFMpeg.cpp: In member function `void 
   MovieTexture_FFMpeg::ConvertFrame()':
arch/MovieTexture/MovieTexture_FFMpeg.cpp:381: error: request for member `
   pix_fmt' in `
   this->MovieTexture_FFMpeg::decoder->FFMpeg_Helper::m_stream->avcodec::AVStream::codec
   ', which is of non-class type `avcodec::AVCodecContext*'
arch/MovieTexture/MovieTexture_FFMpeg.cpp:382: error: request for member `width
   ' in `
   this->MovieTexture_FFMpeg::decoder->FFMpeg_Helper::m_stream->avcodec::AVStream::codec
   ', which is of non-class type `avcodec::AVCodecContext*'
arch/MovieTexture/MovieTexture_FFMpeg.cpp:382: error: request for member `
   height' in `
   this->MovieTexture_FFMpeg::decoder->FFMpeg_Helper::m_stream->avcodec::AVStream::codec
   ', which is of non-class type `avcodec::AVCodecContext*'
arch/MovieTexture/MovieTexture_FFMpeg.cpp: In function `avcodec::AVStream* 
   FindVideoStream(avcodec::AVFormatContext*)':
arch/MovieTexture/MovieTexture_FFMpeg.cpp:392: error: request for member `
   codec_type' in `enc->avcodec::AVStream::codec', which is of non-class type `
   avcodec::AVCodecContext*'
arch/MovieTexture/MovieTexture_FFMpeg.cpp: In constructor `
   MovieTexture_FFMpeg::MovieTexture_FFMpeg(RageTextureID)':
arch/MovieTexture/MovieTexture_FFMpeg.cpp:421: error: request for member `
   bit_rate' in `
   this->MovieTexture_FFMpeg::decoder->FFMpeg_Helper::m_stream->avcodec::AVStream::codec
   ', which is of non-class type `avcodec::AVCodecContext*'
arch/MovieTexture/MovieTexture_FFMpeg.cpp:422: error: request for member `
   pix_fmt' in `
   this->MovieTexture_FFMpeg::decoder->FFMpeg_Helper::m_stream->avcodec::AVStream::codec
   ', which is of non-class type `avcodec::AVCodecContext*'
arch/MovieTexture/MovieTexture_FFMpeg.cpp: In member function `void 
   MovieTexture_FFMpeg::CreateDecoder()':
arch/MovieTexture/MovieTexture_FFMpeg.cpp:576: error: request for member `
   codec_id' in `stream->avcodec::AVStream::codec', which is of non-class type 
   `avcodec::AVCodecContext*'
arch/MovieTexture/MovieTexture_FFMpeg.cpp:577: error: request for member `
   codec_tag' in `stream->avcodec::AVStream::codec', which is of non-class type 
   `avcodec::AVCodecContext*'
arch/MovieTexture/MovieTexture_FFMpeg.cpp:579: error: request for member `
   codec_id' in `stream->avcodec::AVStream::codec', which is of non-class type 
   `avcodec::AVCodecContext*'
arch/MovieTexture/MovieTexture_FFMpeg.cpp:581: error: request for member `
   codec_id' in `stream->avcodec::AVStream::codec', which is of non-class type 
   `avcodec::AVCodecContext*'
arch/MovieTexture/MovieTexture_FFMpeg.cpp:584: error: cannot convert `
   avcodec::AVCodecContext**' to `avcodec::AVCodecContext*' for argument `1' to 
   `int avcodec::avcodec_open(avcodec::AVCodecContext*, avcodec::AVCodec*)'
arch/MovieTexture/MovieTexture_FFMpeg.cpp: In member function `void 
   MovieTexture_FFMpeg::DestroyDecoder()':
arch/MovieTexture/MovieTexture_FFMpeg.cpp:599: error: cannot convert `
   avcodec::AVCodecContext**' to `avcodec::AVCodecContext*' for argument `1' to 
   `int avcodec::avcodec_close(avcodec::AVCodecContext*)'
arch/MovieTexture/MovieTexture_FFMpeg.cpp: In member function `void 
   MovieTexture_FFMpeg::CreateTexture()':
arch/MovieTexture/MovieTexture_FFMpeg.cpp:640: error: request for member `width
   ' in `
   this->MovieTexture_FFMpeg::decoder->FFMpeg_Helper::m_stream->avcodec::AVStream::codec
   ', which is of non-class type `avcodec::AVCodecContext*'
arch/MovieTexture/MovieTexture_FFMpeg.cpp:641: error: request for member `
   height' in `
   this->MovieTexture_FFMpeg::decoder->FFMpeg_Helper::m_stream->avcodec::AVStream::codec
   ', which is of non-class type `avcodec::AVCodecContext*'
arch/MovieTexture/MovieTexture_FFMpeg.cpp: In member function `float 
   MovieTexture_FFMpeg::CheckFrameTime()':
arch/MovieTexture/MovieTexture_FFMpeg.cpp:821: error: request for member `
   frame_number' in `
   this->MovieTexture_FFMpeg::decoder->FFMpeg_Helper::m_stream->avcodec::AVStream::codec
   ', which is of non-class type `avcodec::AVCodecContext*'
make[2]: *** [MovieTexture_FFMpeg.o] Error 1
make[2]: Leaving directory `/var/tmp/portage/stepmania-3.9_rc3/work/StepMania-3.9-rc3-src/src'
make[1]: *** [all] Error 2
make[1]: Leaving directory `/var/tmp/portage/stepmania-3.9_rc3/work/StepMania-3.9-rc3-src/src'
make: *** [all-recursive] Error 1

!!! ERROR: games-arcade/stepmania-3.9_rc3 failed.
!!! Function src_compile, Line 52, Exitcode 2
!!! Make failed
!!! If you need support, post the topmost build error, NOT this status message.
Anyone know how to fix this?
 
Old 11-22-2005, 05:32 AM   #2
cs-cam
Senior Member
 
Registered: May 2004
Location: Australia
Distribution: Gentoo
Posts: 3,544
Blog Entries: 4

Rep: Reputation: 56
I don't know about that particular error but I've installed the binary version from their site (different distro) and it crashes whenever it tried to use ffmpeg to play a movie in the background. Might just be an issue with the current snapshot.
 
  


Reply


Thread Tools Search this Thread
Search this Thread:

Advanced Search

Posting Rules
You may not post new threads
You may not post replies
You may not post attachments
You may not edit your posts

BB code is On
Smilies are On
[IMG] code is Off
HTML code is Off


Similar Threads
Thread Thread Starter Forum Replies Last Post
Emerge xine-ui fails richcm Linux - Software 2 10-18-2005 11:13 AM
Stepmania fails attempting to find sound driver ktvoelker Linux - Games 5 11-18-2004 11:02 AM
Gentoo network less install emerge fails. Nz_Boy_2004 Linux - Distributions 2 09-06-2004 08:13 AM
Gentoo: emerge system fails AncAlAgoN Linux - Laptop and Netbook 2 05-23-2004 09:55 PM
kdemultimedia-3.1.5 fails to emerge...any ideas? Nu-Bee Linux - Software 2 01-19-2004 04:51 PM


All times are GMT -5. The time now is 07:04 PM.

Main Menu
My LQ
Write for LQ
LinuxQuestions.org is looking for people interested in writing Editorials, Articles, Reviews, and more. If you'd like to contribute content, let us know.
Main Menu
Syndicate
RSS1  Latest Threads
RSS1  LQ News
Twitter: @linuxquestions
identi.ca: @linuxquestions
Facebook: linuxquestions Google+: linuxquestions
Open Source Consulting | Domain Registration