LinuxQuestions.org
LinuxAnswers - the LQ Linux tutorial section.
Go Back   LinuxQuestions.org > Forums > Linux Forums > Linux - Distributions > Linux From Scratch
User Name
Password
Linux From Scratch This Forum is for the discussion of LFS.
LFS is a project that provides you with the steps necessary to build your own custom Linux system.

Notices

Reply
 
Search this Thread
Old 05-08-2010, 06:07 AM   #1
Lyle
Member
 
Registered: May 2010
Location: Guyana, South America
Distribution: Debian, Sabayon
Posts: 37

Rep: Reputation: 15
Question test suite for glibc failing | chapter 6.9.1


In chapter 6.9.1. Installation of Glibc. When running the test i get the following errors:
Code:
root:/sources/glibc-bu1ld# grep Error glibc-check-log
make[2]: [/sources/glibc-bu1ld/posix/annexc.out] Error 1 (ignored)
make[2]: *** [/sources/glibc-bu1ld/nptl/tst-attr3.out] Error 1
make[1]: *** [nptl/tests] Error 2
make[2]: *** [/sources/glibc-bu1ld/debug/tst-chk3.out] Error 1
make[2]: *** [/sources/glibc-bu1ld/debug/tst-lfschk3.out] Error 1
make[2]: *** [/sources/glibc-bu1ld/debug/tst-chk6.out] Error 1
make[2]: *** [/sources/glibc-bu1ld/debug/tst-lfschk6.out] Error 1
make[1]: *** [debug/tests] Error 2
make[1]: *** [/sources/glibc-bu1ld/c++-types-check.out] Error 1
make: *** [check] Error 2
Why?
 
Old 05-08-2010, 12:20 PM   #2
crts
Senior Member
 
Registered: Jan 2010
Posts: 1,604

Rep: Reputation: 446Reputation: 446Reputation: 446Reputation: 446Reputation: 446
Hi,

the annexc.out error is non-critical and ignored. In the book it is also mentioned that some tests will fail, especially some nptl tests. There will be more packages that will have some failed tests. As long as you as you do not get any errors during compilation you are probably fine.
 
Old 05-08-2010, 07:46 PM   #3
Lyle
Member
 
Registered: May 2010
Location: Guyana, South America
Distribution: Debian, Sabayon
Posts: 37

Original Poster
Rep: Reputation: 15
Thumbs up

Quote:
Originally Posted by crts View Post
Hi,

the annexc.out error is non-critical and ignored. In the book it is also mentioned that some tests will fail, especially some nptl tests. There will be more packages that will have some failed tests. As long as you as you do not get any errors during compilation you are probably fine.
Thanks. Somehow it passed all the tests today, Even annexc.out (don't know whether to be happy or afriad about this). I changed nothing that i can think of, didnt even recompile it. Weird.... Installed fine too.
Quote:
Your new glibc installation seems to be ok.
make[1]: Leaving directory `/sources/glibc-2.11.1'
Or so it seems.
 
  


Reply


Thread Tools Search this Thread
Search this Thread:

Advanced Search

Posting Rules
You may not post new threads
You may not post replies
You may not post attachments
You may not edit your posts

BB code is On
Smilies are On
[IMG] code is Off
HTML code is Off


Similar Threads
Thread Thread Starter Forum Replies Last Post
glibc-2.3.6 test suite error sanjeet_guddu Linux From Scratch 3 06-10-2010 05:19 PM
glibc error test suite aahiqmir Linux From Scratch 1 12-06-2009 08:45 PM
Errors when running Glibc-2.3.6 test suite (reference: LFS 6.2 chapter 6.9) PingFloyd Linux From Scratch 2 02-02-2007 10:43 PM
Error Running Glibc 64-bit Test Suite (Chapter 10) fatsheep Linux From Scratch 5 10-20-2006 10:19 AM
LFS 6-1: Glibc Test Suite Fails at end with 2 errors in Chapter 6 TGWDNGHN Linux From Scratch 1 07-26-2005 01:23 PM


All times are GMT -5. The time now is 11:23 AM.

Main Menu
My LQ
Write for LQ
LinuxQuestions.org is looking for people interested in writing Editorials, Articles, Reviews, and more. If you'd like to contribute content, let us know.
Main Menu
Syndicate
RSS1  Latest Threads
RSS1  LQ News
Twitter: @linuxquestions
identi.ca: @linuxquestions
Facebook: linuxquestions Google+: linuxquestions
Open Source Consulting | Domain Registration