-   Linux From Scratch (
-   -   Tar-1.13.25 Build Error (

Smartcat99S 03-17-2004 01:50 PM

Tar-1.13.25 Build Error
Compiling Tar-1.13.25 in Chapter 5

if gcc -DHAVE_CONFIG_H -I. -I. -I.. -I../intl -g -O2 -MT getdate.o -MD -MP -MF ".deps/getdate.Tpo" -c -o getdate.o getdate.c; \
then mv -f ".deps/getdate.Tpo" ".deps/getdate.Po"; else rm -f ".deps/getdate.Tpo"; exit 1; fi
getdate.y: In function `yyparse':
getdate.y:381: error: parse error before '}' token
getdate.y:387: error: parse error before '}' token
getdate.y:393: error: parse error before '}' token
make[2]: *** [getdate.o] Error 1
make[2]: Leaving directory `/mnt/lfs/sources/tar-1.13.25/lib'
make[1]: *** [all-recursive] Error 1
make[1]: Leaving directory `/mnt/lfs/sources/tar-1.13.25'
make: *** [all] Error 2

LFS CVS 3-4-04
RH9 Host

???Is this a corrupted source ball???

Smartcat99S 04-01-2004 03:53 PM

It was bison-1.75 and 3 missing semicolons.
using 1.875, it works.

All times are GMT -5. The time now is 06:24 AM.