LinuxQuestions.org

LinuxQuestions.org (/questions/)
-   Linux From Scratch (http://www.linuxquestions.org/questions/linux-from-scratch-13/)
-   -   "make headers_check" gives errors during "5.5.1 Installation of Linux API headers " (http://www.linuxquestions.org/questions/linux-from-scratch-13/make-headers_check-gives-errors-during-5-5-1-installation-of-linux-api-headers-586542/)

void_man() 09-22-2007 08:35 AM

"make headers_check" gives errors during "5.5.1 Installation of Linux API headers "
 
I'm a newbie, and trying out lfs.
i'm stuck in the Installation of linux api headers,
the command
Code:

make mrproper
gives no error
but,
Code:

make headers_check
gives a big list of errors n warnings.

i believe i have followed properly everything before 5.5.1 Installation of Linux API headers.
I'm executing the make commands from within "$LFS/sources/linux-2.6.22.5"

Below is the error output i get:

Command:
Code:

make headers_check
Output:
Code:

  CHK    include/linux/version.h
  HOSTCC  scripts/basic/fixdep
scripts/basic/fixdep.c:107:23: error: sys/types.h: No such file or directory
scripts/basic/fixdep.c:108:22: error: sys/stat.h: No such file or directory
scripts/basic/fixdep.c:109:22: error: sys/mman.h: No such file or directory
scripts/basic/fixdep.c:110:20: error: unistd.h: No such file or directory
scripts/basic/fixdep.c:111:19: error: fcntl.h: No such file or directory
scripts/basic/fixdep.c:112:20: error: string.h: No such file or directory
scripts/basic/fixdep.c:113:20: error: stdlib.h: No such file or directory
scripts/basic/fixdep.c:114:19: error: stdio.h: No such file or directory
In file included from /media/lfs/tools/bin/../lib/gcc/i686-pc-linux-gnu/4.0.3/include/syslimits.h:7,
                from /media/lfs/tools/bin/../lib/gcc/i686-pc-linux-gnu/4.0.3/include/limits.h:11,
                from scripts/basic/fixdep.c:115:
/media/lfs/tools/bin/../lib/gcc/i686-pc-linux-gnu/4.0.3/include/limits.h:122:61: error: limits.h: No such file or directory
scripts/basic/fixdep.c:116:19: error: ctype.h: No such file or directory
scripts/basic/fixdep.c:117:23: error: arpa/inet.h: No such file or directory
scripts/basic/fixdep.c: In function 'usage':
scripts/basic/fixdep.c:131: warning: implicit declaration of function 'fprintf'
scripts/basic/fixdep.c:131: warning: incompatible implicit declaration of built-in function 'fprintf'
scripts/basic/fixdep.c:131: error: 'stderr' undeclared (first use in this function)
scripts/basic/fixdep.c:131: error: (Each undeclared identifier is reported only once
scripts/basic/fixdep.c:131: error: for each function it appears in.)
scripts/basic/fixdep.c:132: warning: implicit declaration of function 'exit'
scripts/basic/fixdep.c:132: warning: incompatible implicit declaration of built-in function 'exit'
scripts/basic/fixdep.c: In function 'print_cmdline':
scripts/basic/fixdep.c:140: warning: implicit declaration of function 'printf'
scripts/basic/fixdep.c:140: warning: incompatible implicit declaration of built-in function 'printf'
scripts/basic/fixdep.c: At top level:
scripts/basic/fixdep.c:143: error: 'NULL' undeclared here (not in a function)
scripts/basic/fixdep.c: In function 'grow_config':
scripts/basic/fixdep.c:156: warning: implicit declaration of function 'realloc'
scripts/basic/fixdep.c:156: warning: assignment makes pointer from integer without a cast
scripts/basic/fixdep.c:158: warning: implicit declaration of function 'perror'
scripts/basic/fixdep.c:158: warning: incompatible implicit declaration of built-in function 'exit'
scripts/basic/fixdep.c: In function 'is_defined_config':
scripts/basic/fixdep.c:174: warning: implicit declaration of function 'memcmp'
scripts/basic/fixdep.c: In function 'define_config':
scripts/basic/fixdep.c:187: warning: implicit declaration of function 'memcpy'
scripts/basic/fixdep.c:187: warning: incompatible implicit declaration of built-in function 'memcpy'
scripts/basic/fixdep.c: In function 'use_config':
scripts/basic/fixdep.c:206: error: 'PATH_MAX' undeclared (first use in this function)
scripts/basic/fixdep.c:214: warning: incompatible implicit declaration of built-in function 'memcpy'
scripts/basic/fixdep.c:220: warning: implicit declaration of function 'tolower'
scripts/basic/fixdep.c:222: warning: incompatible implicit declaration of built-in function 'printf'
scripts/basic/fixdep.c:206: warning: unused variable 's'
scripts/basic/fixdep.c: At top level:
scripts/basic/fixdep.c:225: error: syntax error before 'size_t'
scripts/basic/fixdep.c:226: warning: function declaration isn't a prototype
scripts/basic/fixdep.c: In function 'parse_config_file':
scripts/basic/fixdep.c:227: error: 'map' undeclared (first use in this function)
scripts/basic/fixdep.c:227: error: 'len' undeclared (first use in this function)
scripts/basic/fixdep.c:233: warning: implicit declaration of function 'ntohl'
scripts/basic/fixdep.c:244: warning: implicit declaration of function 'isalnum'
scripts/basic/fixdep.c: In function 'strrcmp':
scripts/basic/fixdep.c:261: warning: implicit declaration of function 'strlen'
scripts/basic/fixdep.c:261: warning: incompatible implicit declaration of built-in function 'strlen'
scripts/basic/fixdep.c: In function 'do_config_file':
scripts/basic/fixdep.c:272: error: storage size of 'st' isn't known
scripts/basic/fixdep.c:276: warning: implicit declaration of function 'open'
scripts/basic/fixdep.c:276: error: 'O_RDONLY' undeclared (first use in this function)
scripts/basic/fixdep.c:278: warning: incompatible implicit declaration of built-in function 'fprintf'
scripts/basic/fixdep.c:278: error: 'stderr' undeclared (first use in this function)
scripts/basic/fixdep.c:280: warning: incompatible implicit declaration of built-in function 'exit'
scripts/basic/fixdep.c:282: warning: implicit declaration of function 'fstat'
scripts/basic/fixdep.c:284: warning: implicit declaration of function 'close'
scripts/basic/fixdep.c:287: warning: implicit declaration of function 'mmap'
scripts/basic/fixdep.c:287: error: 'PROT_READ' undeclared (first use in this function)
scripts/basic/fixdep.c:287: error: 'MAP_PRIVATE' undeclared (first use in this function)
scripts/basic/fixdep.c:287: warning: assignment makes pointer from integer without a cast
scripts/basic/fixdep.c:296: warning: implicit declaration of function 'munmap'
scripts/basic/fixdep.c:272: warning: unused variable 'st'
scripts/basic/fixdep.c: At top level:
scripts/basic/fixdep.c:301: error: syntax error before 'size_t'
scripts/basic/fixdep.c:302: warning: function declaration isn't a prototype
scripts/basic/fixdep.c: In function 'parse_dep_file':
scripts/basic/fixdep.c:303: error: 'map' undeclared (first use in this function)
scripts/basic/fixdep.c:304: error: 'len' undeclared (first use in this function)
scripts/basic/fixdep.c:306: error: 'PATH_MAX' undeclared (first use in this function)
scripts/basic/fixdep.c:308: warning: implicit declaration of function 'strchr'
scripts/basic/fixdep.c:308: warning: incompatible implicit declaration of built-in function 'strchr'
scripts/basic/fixdep.c:310: warning: incompatible implicit declaration of built-in function 'fprintf'
scripts/basic/fixdep.c:310: error: 'stderr' undeclared (first use in this function)
scripts/basic/fixdep.c:311: warning: incompatible implicit declaration of built-in function 'exit'
scripts/basic/fixdep.c:313: warning: incompatible implicit declaration of built-in function 'memcpy'
scripts/basic/fixdep.c:314: warning: incompatible implicit declaration of built-in function 'printf'
scripts/basic/fixdep.c:306: warning: unused variable 's'
scripts/basic/fixdep.c: In function 'print_deps':
scripts/basic/fixdep.c:343: error: storage size of 'st' isn't known
scripts/basic/fixdep.c:347: error: 'O_RDONLY' undeclared (first use in this function)
scripts/basic/fixdep.c:349: warning: incompatible implicit declaration of built-in function 'fprintf'
scripts/basic/fixdep.c:349: error: 'stderr' undeclared (first use in this function)
scripts/basic/fixdep.c:351: warning: incompatible implicit declaration of built-in function 'exit'
scripts/basic/fixdep.c:355: warning: incompatible implicit declaration of built-in function 'fprintf'
scripts/basic/fixdep.c:359: error: 'PROT_READ' undeclared (first use in this function)
scripts/basic/fixdep.c:359: error: 'MAP_PRIVATE' undeclared (first use in this function)
scripts/basic/fixdep.c:359: warning: assignment makes pointer from integer without a cast
scripts/basic/fixdep.c:343: warning: unused variable 'st'
scripts/basic/fixdep.c: In function 'traps':
scripts/basic/fixdep.c:378: warning: incompatible implicit declaration of built-in function 'fprintf'
scripts/basic/fixdep.c:378: error: 'stderr' undeclared (first use in this function)
scripts/basic/fixdep.c:380: warning: incompatible implicit declaration of built-in function 'exit'
make[1]: *** [scripts/basic/fixdep] Error 1
make: *** [scripts_basic] Error 2


jdiggitydogg 09-23-2007 03:23 PM

one problem, its not finding your standard c library header files. make sure libc is installed. /usr/include should be full of .h files.

Jaqui 09-25-2007 01:09 PM

note: using any tests in chapter 5 is a waste of effort, since the additional software the tests require is not installed.

if you used /mnt/lfs and $LFS/tools as recommended see if the kernel headers are in the /tools/usr/include directory tree. make headers_check will not give valid results this early in the book.

satheesh_2307 09-26-2007 09:16 PM

I am also getting errors during "make headers_check". Here is the error.

CHK include/linux/version.h
UPD include/linux/version.h
HOSTCC scripts/basic/fixdep
HOSTCC scripts/basic/docproc
HOSTCC scripts/unifdef
scripts/unifdef.c: In function 'Mpass':
scripts/unifdef.c:377: warning: value computed is not used
make[1]: *** No rule to make target `|', needed by `asm-generic'. Stop.
make: *** [headers_install] Error 2

/usr/include directory contains all headers. Where should be the problem then?


All times are GMT -5. The time now is 07:56 AM.