LinuxQuestions.org
Help answer threads with 0 replies.
Go Back   LinuxQuestions.org > Forums > Linux Forums > Linux - Distributions > Linux From Scratch
User Name
Password
Linux From Scratch This Forum is for the discussion of LFS.
LFS is a project that provides you with the steps necessary to build your own custom Linux system.

Notices



Reply
 
Search this Thread
Old 08-01-2011, 08:46 PM   #1
edgezors
LQ Newbie
 
Registered: Jul 2011
Location: South Carolina, USA
Distribution: LFS
Posts: 6

Rep: Reputation: Disabled
Exclamation Make Check Errors for ORbit2.14.19


I'm starting to compile and install the gnome environment and the first package Orbit2.14.19 for the core packages. Everything compiles fine but the issue comes up in running the test suite.
The section that results in the error is:


Code:
PASS: test-dynany
mem usage prev/post:  1660KB /  1760KB --  1000x test_ORBit_alloc ()
**
ERROR:test-mem.c:239:main_func: assertion failed: (mem_usage_end - mem_usage_start < 50)
/bin/sh: line 5:  7012 Aborted                 ${dir}$tst
FAIL: test-mem
ORB: init took 0.568(ms)
Testing copy...
 copy IDL:omg.org/CORBA/octet:1.0 : 0.000105(ms)
 copy               (null) : 0.000114(ms)
 copy IDL:omg.org/CORBA/double:1.0 : 0.000112(ms)
 copy IDL:omg.org/CORBA/string:1.0 : 0.000165(ms)
 copy               (null) : 0.000109(ms)
 copy IDL:omg.org/GIOP/TargetAddress:1.0 : 0.000662(ms)
Testing strdup ...
 g_strdup :     0.0736(ns)
 CORBA_strdup : 0.0756(ns)
Testing object activation...
 activation : 0.001475(ms)
 de-activation : 0.00259(ms)
ORB: destroy took 0.025(ms)
Overall bogomark 164631
PASS: test-performance

** (process:7062): WARNING **: GIOP test hooks only enabled in a debugging build
PASS: test-giop
running... 
verify "corbaloc:iiop:localhost:9999/NameService"
verify "corbaloc:iiop:1.2@localhost/NameService"
verify "corbaloc:iiop:gnome.org:8888,iiop:gnome.de:7777/NameService"
verify "corbaloc::gnome.org:8888,:gnome.de:7777/NameService"
verify "corbaloc::gnome.org,:gnome.de/NameService"
verify "iiop:1.2@home.de/objkey"
verify "iiop:gnome.org:8787/NameService"
verify "iiop:gnome.org/NameService"
verify "iiop://gnome.org/NameService"
verify "corbaloc:iiops:localhost:8885/NameService"
verify "corbaloc:iiops:localhost:8885/%4e%61%6d%65%53%65%72%76%69%63%65"
verify "corbaloc:ssliop:localhost:8885/NameService"
verify "corbaloc:uiop:/tmp/orbit-frehberg-3333:/NameService"
verify "corbaloc:uiop:/tmp/orbit-frehberg-3333:,iiop:localhost:88/NameService"
PASS: test-corbaloc
=======================================================================
1 of 6 tests failed
Please report to http://bugzilla.gnome.org/enter_bug.cgi?product=ORBit2
=======================================================================
make[4]: *** [check-TESTS] Error 1
make[4]: Leaving directory `/blfs-sources/ORBit2-2.14.19/test'
make[3]: *** [check-am] Error 2
make[3]: Leaving directory `/blfs-sources/ORBit2-2.14.19/test'
make[2]: *** [check-recursive] Error 1
make[2]: Leaving directory `/blfs-sources/ORBit2-2.14.19/test'
make[1]: *** [check] Error 2
make[1]: Leaving directory `/blfs-sources/ORBit2-2.14.19/test'
make: *** [check-recursive] Error 1
As you can see the offending tests is test-mem

Code:
ERROR:test-mem.c:239:main_func: assertion failed: (mem_usage_end - mem_usage_start < 50)
/bin/sh: line 5:  7012 Aborted                 ${dir}$tst
FAIL: test-mem
I've done a bit of googling today and the only thing I've found is a bugzilla post of someone in Fedora running the test suite with no suggestions of how to fix it. It may be a negligible error but it doesn't seem to be that common. Anyone have any clues on how to fix this or if it can be ignored safely?

Last edited by edgezors; 08-01-2011 at 08:48 PM. Reason: Grammar and english clearity
 
  


Reply

Tags
error, gnome, lfs, source, sourcecode


Thread Tools Search this Thread
Search this Thread:

Advanced Search

Posting Rules
You may not post new threads
You may not post replies
You may not post attachments
You may not edit your posts

BB code is On
Smilies are On
[IMG] code is Off
HTML code is Off


Similar Threads
Thread Thread Starter Forum Replies Last Post
Lot of errors with E2fsprogs-1.41.14 make check deedend Linux From Scratch 13 01-06-2012 05:29 AM
Glibc make check errors, safe to continue kummiliim Linux From Scratch 0 03-02-2008 05:40 PM
Glibc-2.5.1 make check errors shomaster Linux From Scratch 1 09-10-2007 05:44 PM
fc7 how can i make check for errors on my hard drive Muhammed Linux - Software 2 08-27-2007 06:28 PM
Chapter 6.12 GCC make -k check errors kz_chopper Linux From Scratch 2 02-21-2007 12:54 AM


All times are GMT -5. The time now is 10:57 AM.

Main Menu
Advertisement
My LQ
Write for LQ
LinuxQuestions.org is looking for people interested in writing Editorials, Articles, Reviews, and more. If you'd like to contribute content, let us know.
Main Menu
Syndicate
RSS1  Latest Threads
RSS1  LQ News
Twitter: @linuxquestions
identi.ca: @linuxquestions
Facebook: linuxquestions Google+: linuxquestions
Open Source Consulting | Domain Registration