LinuxQuestions.org
Go Job Hunting at the LQ Job Marketplace
Go Back   LinuxQuestions.org > Forums > Linux Forums > Linux - Distributions > Linux From Scratch
User Name
Password
Linux From Scratch This Forum is for the discussion of LFS.
LFS is a project that provides you with the steps necessary to build your own custom Linux system.

Notices

Reply
 
Search this Thread
Old 07-26-2005, 12:04 PM   #1
TGWDNGHN
Member
 
Registered: Aug 2003
Distribution: Slackware 10.0
Posts: 94
Blog Entries: 1

Rep: Reputation: 15
LFS 6-1: Glibc Test Suite Fails at end with 2 errors in Chapter 6


I am in chapter 6, building the glibc library. I completed Chapter 5 (The temporary System) without any problems (that I know of - that is, if I missed it on accident). Everything went as planned, and I proceeded into Chapter 6. I Chrooted
into the enviroment and set everything up as the book said. Then I followed the steps exactly on making the glibc library. I type "make"- no problems. When I did the "make check", however, this appeared at the very end:


make[2]: *** [/glibc-build/libio/tst-fopenloc.check] Error 127
make[2]: Leaving directory `/glibc-build/libio'
make[1]: *** [libio/tests] Error 2
make[1]: Leaving directory `glibc-2.3.4'
make: *** [check] Error 2

Now, the book says some problems are unavoidable but unfortunately it does not give you any insight on what to do about them (even the few examples it listed).

I would like some reassurance: can I proceed to build my LFS system with this problem? Or is there a work-around?


My Host System is Mandrake Linux Powerpack 10.1
 
Old 07-26-2005, 12:23 PM   #2
kjordan
Member
 
Registered: Jul 2004
Distribution: LFS, I felt the itch and scratched it
Posts: 227

Rep: Reputation: 31
Unfortunately you pasted the part that just says there was an error and not the specific error. Unless there is something about your host environment that would interfere with a successful build or there was something accidentally mistyped to screw something else up, you can usually proceed without worry.
 
  


Reply


Thread Tools Search this Thread
Search this Thread:

Advanced Search

Posting Rules
You may not post new threads
You may not post replies
You may not post attachments
You may not edit your posts

BB code is On
Smilies are On
[IMG] code is Off
HTML code is Off


Similar Threads
Thread Thread Starter Forum Replies Last Post
Errors during the test suite for Glibc-20050926 32 Bit � Cross compile x86_64 Basel Linux From Scratch 3 10-29-2005 06:45 AM
LFS 6.0 Chapter 6: compiling glibc problem Sakur Linux From Scratch 3 08-13-2005 11:39 PM
Error in Glibc Chapter-6 LFS ver-6..Help pls?? chakkaradeepcc Linux From Scratch 10 05-23-2005 12:33 PM
now getting error in coreutils test(chapter 6-lfs-5.1.1) linuxbh Linux From Scratch 2 09-16-2004 02:45 AM
LFS 3.3 - chapter 6 - glibc error fend88 Linux From Scratch 5 04-28-2002 11:06 PM


All times are GMT -5. The time now is 06:47 AM.

Main Menu
My LQ
Write for LQ
LinuxQuestions.org is looking for people interested in writing Editorials, Articles, Reviews, and more. If you'd like to contribute content, let us know.
Main Menu
Syndicate
RSS1  Latest Threads
RSS1  LQ News
Twitter: @linuxquestions
identi.ca: @linuxquestions
Facebook: linuxquestions Google+: linuxquestions
Open Source Consulting | Domain Registration