LinuxQuestions.org
Support LQ: Use code LQ3 and save $3 on Domain Registration
Go Back   LinuxQuestions.org > Forums > Linux Forums > Linux - Distributions > Linux From Scratch
User Name
Password
Linux From Scratch This Forum is for the discussion of LFS.
LFS is a project that provides you with the steps necessary to build your own custom Linux system.

Notices

Reply
 
Search this Thread
Old 06-13-2003, 09:00 AM   #1
safrout
Member
 
Registered: Mar 2002
Location: egypt
Distribution: Gentoo
Posts: 457

Rep: Reputation: 30
GCC error when compiling it for LFS


i got this error when trying to compile gcc-3.2.1 for building LFS 4.1
in chapter ^ after chroooting and mounting my proc

i got this error when trying to " make bootstrap"



-----------------------------------------------------------------------------
./../gcc-3.2.1/gcc/regclass.c: In function `init_reg_sets_1':
../../gcc-3.2.1/gcc/regclass.c:490: warning: comparison between signed and unsigned
../../gcc-3.2.1/gcc/regclass.c: In function `choose_hard_reg_mode':
../../gcc-3.2.1/gcc/regclass.c:700: warning: comparison between signed and unsigned
../../gcc-3.2.1/gcc/regclass.c:710: warning: comparison between signed and unsigned
../../gcc-3.2.1/gcc/regclass.c:720: warning: comparison between signed and unsigned
../../gcc-3.2.1/gcc/regclass.c:730: warning: comparison between signed and unsigned
../../gcc-3.2.1/gcc/regclass.c:741: warning: comparison between signed and unsigned
../../gcc-3.2.1/gcc/regclass.c: In function `record_reg_classes':
../../gcc-3.2.1/gcc/regclass.c:1869: warning: comparison between signed and unsigned
../../gcc-3.2.1/gcc/regclass.c:1876: warning: comparison between signed and unsigned
../../gcc-3.2.1/gcc/regclass.c:1882: warning: comparison between signed and unsigned
../../gcc-3.2.1/gcc/regclass.c:1889: warning: comparison between signed and unsigned
gcc -c -DIN_GCC -g -W -Wall -Wwrite-strings -Wstrict-prototypes -Wmissing-prototypes -Wtraditional -pedantic -Wno-long-long -DHAVE_CONFIG_H -I. -I. -I../../gcc-3.2.1/gcc -I../../gcc-3.2.1/gcc/. -I../../gcc-3.2.1/gcc/config -I../../gcc-3.2.1/gcc/../include ../../gcc-3.2.1/gcc/regmove.c -o regmove.o
gcc -c -DIN_GCC -g -W -Wall -Wwrite-strings -Wstrict-prototypes -Wmissing-prototypes -Wtraditional -pedantic -Wno-long-long -DHAVE_CONFIG_H -I. -I. -I../../gcc-3.2.1/gcc -I../../gcc-3.2.1/gcc/. -I../../gcc-3.2.1/gcc/config -I../../gcc-3.2.1/gcc/../include ../../gcc-3.2.1/gcc/regrename.c -o regrename.o
gcc -c -DIN_GCC -g -W -Wall -Wwrite-strings -Wstrict-prototypes -Wmissing-prototypes -Wtraditional -pedantic -Wno-long-long -DHAVE_CONFIG_H -I. -I. -I../../gcc-3.2.1/gcc -I../../gcc-3.2.1/gcc/. -I../../gcc-3.2.1/gcc/config -I../../gcc-3.2.1/gcc/../include ../../gcc-3.2.1/gcc/reload.c -o reload.o
../../gcc-3.2.1/gcc/reload.c: In function `find_reloads_address_1':
../../gcc-3.2.1/gcc/reload.c:5648: warning: comparison between signed and unsigned
/tmp/ccI1F66i.s: Assembler messages:
/tmp/ccI1F66i.s:46217: Error: unknown pseudo-op: `.cyte'
make[2]: *** [reload.o] Error 1
make[2]: Leaving directory `/usr/working/gcc-build/gcc'
make[1]: *** [stage1_build] Error 2
make[1]: Leaving directory `/usr/working/gcc-build/gcc'
make: *** [bootstrap] Error 2
root:/usr/working/gcc-build#
------------------------------------------------------------------------------------------

it was the second ime got an error while compiling gcc the first time the system hanged as soon as i got the error

can anyone help

Last edited by safrout; 06-13-2003 at 09:10 AM.
 
Old 06-14-2003, 06:16 AM   #2
safrout
Member
 
Registered: Mar 2002
Location: egypt
Distribution: Gentoo
Posts: 457

Original Poster
Rep: Reputation: 30
is it that hard or have i found a bug
 
  


Reply


Thread Tools Search this Thread
Search this Thread:

Advanced Search

Posting Rules
You may not post new threads
You may not post replies
You may not post attachments
You may not edit your posts

BB code is On
Smilies are On
[IMG] code is Off
HTML code is Off


Similar Threads
Thread Thread Starter Forum Replies Last Post
Error Compiling GCC (1st Pass) in LFS 6.0 TGWDNGHN Linux From Scratch 1 06-30-2005 08:57 PM
gcc make error in ch5.5 of LFS 6.0 Barnette Linux From Scratch 5 01-03-2005 11:09 AM
Error compiling ncurses in lfs 6.0 Drunkalot Linux From Scratch 2 12-25-2004 11:21 PM
GCC first build for LFS, bootstrap error Blibblob Linux From Scratch 8 01-07-2004 05:50 PM
Error compiling Perl (making LFS system 3.3)... MatMan5959 Linux - Software 0 06-02-2002 04:36 PM


All times are GMT -5. The time now is 05:24 PM.

Main Menu
My LQ
Write for LQ
LinuxQuestions.org is looking for people interested in writing Editorials, Articles, Reviews, and more. If you'd like to contribute content, let us know.
Main Menu
Syndicate
RSS1  Latest Threads
RSS1  LQ News
Twitter: @linuxquestions
identi.ca: @linuxquestions
Facebook: linuxquestions Google+: linuxquestions
Open Source Consulting | Domain Registration