LinuxQuestions.org
Download your favorite Linux distribution at LQ ISO.
Go Back   LinuxQuestions.org > Forums > Linux Forums > Linux - Distributions > Linux From Scratch
User Name
Password
Linux From Scratch This Forum is for the discussion of LFS.
LFS is a project that provides you with the steps necessary to build your own custom Linux system.

Notices

Reply
 
Search this Thread
Old 02-28-2004, 03:33 PM   #1
RTT
Member
 
Registered: Nov 2003
Location: England
Distribution: slackware, FreeBSD
Posts: 33

Rep: Reputation: 15
gcc-3.3.1 compile errors


My host OS is slackware-9.1

Error as follows:

Code:
stage1/xgcc -Bstage1/ -B/tools/i586-pc-linux-gnu/bin/   -g -O2 -DIN_GCC   -W -Wall -Wwrite-strings -Wstrict-prototypes -Wmissing-prototypes -Wtraditional -pedantic -Wno-long-long   -DHAVE_CONFIG_H    -I. -I. -I../../gcc-3.3.1/gcc -I../../gcc-3.3.1/gcc/. -I../../gcc-3.3.1/gcc/config -I../../gcc-3.3.1/gcc/../include -c insn-recog.c \
  -o insn-recog.o
/tmp/ccNxxSuF.s: Assembler messages:
/tmp/ccNxxSuF.s:49089: Error: invalid char '[' beginning operand 1 `[%edi]'
/tmp/ccNxxSuF.s:63267: Error: invalid char '[' beginning operand 1 `[%eax]'
/tmp/ccNxxSuF.s:64636: Error: invalid char '[' beginning operand 1 `[%esi+4]'
/tmp/ccNxxSuF.s:65939: Error: invalid char '[' beginning operand 1 `[%edx+4]'
/tmp/ccNxxSuF.s:67188: Error: invalid char '[' beginning operand 2 `[%edi]'
/tmp/ccNxxSuF.s:72299: Error: invalid char '[' beginning operand 1 `[%ebx]'
/tmp/ccNxxSuF.s:73694: Error: invalid char '[' beginning operand 1 `[%edx]'
/tmp/ccNxxSuF.s:81284: Error: invalid char '[' beginning operand 1 `[%ebx]'
/tmp/ccNxxSuF.s:86064: Error: invalid char '[' beginning operand 1 `[%ebp+12]'
/tmp/ccNxxSuF.s:87758: Error: invalid char '[' beginning operand 1 `[%ebp-16]'
make[2]: *** [insn-recog.o] Error 1
make[2]: Leaving directory `/sources/gcc-build/gcc'
make[1]: *** [stage2_build] Error 2
make[1]: Leaving directory `/sources/gcc-build/gcc'
make: *** [bootstrap] Error 2
lfs@muh:/sources/gcc-build$
Would it be a really bad thing to do if i didn't compile it with the bootstrap option and hope that it compiles correctly first time around?


Last edited by RTT; 02-28-2004 at 03:52 PM.
 
Old 02-28-2004, 06:53 PM   #2
bnice
Member
 
Registered: Feb 2004
Location: Sacramento, CA
Distribution: Slack 9.1, slackware-current
Posts: 284

Rep: Reputation: 30
Why don't you go one better and download the slackware package to upgrade to 3.3.3?
 
  


Reply


Thread Tools Search this Thread
Search this Thread:

Advanced Search

Posting Rules
You may not post new threads
You may not post replies
You may not post attachments
You may not edit your posts

BB code is On
Smilies are On
[IMG] code is Off
HTML code is Off


Similar Threads
Thread Thread Starter Forum Replies Last Post
Nvu by gcc 4.0 .. compile errors! TokyoYank Linux - Software 0 11-01-2005 02:15 AM
kernel compile errors with gcc 3.4.2 MarleyGPN Linux - Software 0 09-29-2004 07:03 PM
gcc compile errors ? qwijibow Linux - Newbie 2 07-21-2003 07:20 AM
gcc errors?? or are they? Rito Linux From Scratch 1 01-06-2003 04:54 PM
make and gcc compile errors sedandawk Linux - General 1 12-18-2002 02:56 AM


All times are GMT -5. The time now is 07:42 AM.

Main Menu
My LQ
Write for LQ
LinuxQuestions.org is looking for people interested in writing Editorials, Articles, Reviews, and more. If you'd like to contribute content, let us know.
Main Menu
Syndicate
RSS1  Latest Threads
RSS1  LQ News
Twitter: @linuxquestions
identi.ca: @linuxquestions
Facebook: linuxquestions Google+: linuxquestions
Open Source Consulting | Domain Registration