LinuxQuestions.org
Support LQ: Use code LQ3 and save $3 on Domain Registration
Go Back   LinuxQuestions.org > Forums > Linux Forums > Linux - Distributions > Linux From Scratch
User Name
Password
Linux From Scratch This Forum is for the discussion of LFS.
LFS is a project that provides you with the steps necessary to build your own custom Linux system.

Notices



Reply
 
Search this Thread
Old 04-29-2003, 02:47 AM   #1
xquizit
Member
 
Registered: Mar 2003
Location: Canada
Distribution: Ubuntu Dapper
Posts: 68

Rep: Reputation: 15
fileutils problem


Hi for some reason I cant install "Fileutils-4.1" here is the make and then the make install error. I also used the patch. And I am using knoppix.

"Make"

Making all in lib
make[1]: Entering directory `/ramdisk/home/knoppix/tmp/fileutils-4.1/lib'
make all-am
make[2]: Entering directory `/ramdisk/home/knoppix/tmp/fileutils-4.1/lib'
source='getdate.c' object='getdate.o' libtool=no \
depfile='.deps/getdate.Po' tmpdepfile='.deps/getdate.TPo' \
depmode=gcc3 /bin/sh ../depcomp \
gcc -DLIBDIR=\"/mnt/hda6/static/lib\" -DHAVE_CONFIG_H -I.. -I. -I../intl -g -O2 -c -o getdate.o `test -f getdate.c || echo './'`getdate.c
getdate.y: In function `yyparse':
getdate.y:381: syntax error before '}' token
getdate.y:387: syntax error before '}' token
getdate.y:393: syntax error before '}' token
make[2]: *** [getdate.o] Error 1
make[2]: Leaving directory `/ramdisk/home/knoppix/tmp/fileutils-4.1/lib'
make[1]: *** [all] Error 2
make[1]: Leaving directory `/ramdisk/home/knoppix/tmp/fileutils-4.1/lib'
make: *** [all-recursive] Error 1

"make install"

Making install in lib
make[1]: Entering directory `/ramdisk/home/knoppix/tmp/fileutils-4.1/lib'
source='getdate.c' object='getdate.o' libtool=no \
depfile='.deps/getdate.Po' tmpdepfile='.deps/getdate.TPo' \
depmode=gcc3 /bin/sh ../depcomp \
gcc -DLIBDIR=\"/mnt/hda6/static/lib\" -DHAVE_CONFIG_H -I.. -I. -I../intl -g -O2 -c -o getdate.o `test -f getdate.c || echo './'`getdate.c
getdate.y: In function `yyparse':
getdate.y:381: syntax error before '}' token
getdate.y:387: syntax error before '}' token
getdate.y:393: syntax error before '}' token
make[1]: *** [getdate.o] Error 1
make[1]: Leaving directory `/ramdisk/home/knoppix/tmp/fileutils-4.1/lib'
make: *** [install-recursive] Error 1

TIA
xquizit
 
Old 04-29-2003, 05:08 AM   #2
whansard
Senior Member
 
Registered: Dec 2002
Location: Mosquitoville
Distribution: RH 6.2, Gen2, Knoppix, 98,2000 + various
Posts: 3,171

Rep: Reputation: 52
you could do a make -i and see
if most of the stuff compiles.

i've done make -i install
dozens of times, to get a mostly or partly functioning
package.
 
Old 04-30-2003, 10:42 PM   #3
mdh
Member
 
Registered: Nov 2002
Location: Melbourne, Australia
Distribution: (C)LFS (x86_64, ix86, sparcv9, ppc)
Posts: 121

Rep: Reputation: 15
What versions of bison/flex are you using?
 
  


Reply


Thread Tools Search this Thread
Search this Thread:

Advanced Search

Posting Rules
You may not post new threads
You may not post replies
You may not post attachments
You may not edit your posts

BB code is On
Smilies are On
[IMG] code is Off
HTML code is Off


Similar Threads
Thread Thread Starter Forum Replies Last Post
coreutils/fileutils for Windows? CPUFreak91 General 3 09-30-2005 06:51 PM
perl problem? apache problem? cgi problem? WorldBuilder Linux - Software 1 09-17-2003 08:45 PM
Fileutils... Chijtska Linux From Scratch 1 02-13-2002 10:27 PM
Having a problem with installing fileutils hanzerik Linux From Scratch 4 02-08-2002 01:50 PM


All times are GMT -5. The time now is 04:13 PM.

Main Menu
Advertisement
My LQ
Write for LQ
LinuxQuestions.org is looking for people interested in writing Editorials, Articles, Reviews, and more. If you'd like to contribute content, let us know.
Main Menu
Syndicate
RSS1  Latest Threads
RSS1  LQ News
Twitter: @linuxquestions
identi.ca: @linuxquestions
Facebook: linuxquestions Google+: linuxquestions
Open Source Consulting | Domain Registration